{"text_format":"1","workbook":"xlsx","n_sheets":26,"sheets":["24","33","40","47","64","TOTAUX AQ","16","17","79","86","TOTAUX CP","19","23","87","TOTAUX LIM","TOTAL GÉNÉRAL","Évolutions Ligue","Graphique aquitaine","Graphique LNAE","STATISTIQUES LNAE","FEUILLE de SAISIE","Feuille des licences","STATISTIQUES GÉNÉRALES","Ordre des clubs","Grille saisie 1","Grille saisie 2"],"not_rendered":{"charts":3,"images":0,"macros":0,"external_links":0,"defined_names":8,"comments":0,"pivot_tables":0},"unopened":[],"bounds":{"document_bytes":16777216,"sheet_cells":100000,"rows_first":2000,"rows_last":500,"rows_between":2000,"halvings":0,"cell_chars":16384,"cell_head_chars":4096},"cells_cut":0,"cells_raw":0,"read":"whole","date_system":"1900"}

{"sheet":"24","index":0,"n_rows":11,"n_cols":28,"rows_kept":11,"cut":false,"hidden":false,"merged":[[3,27,4,27],[1,1,1,27],[3,13,4,13],[3,25,4,25],[3,26,4,26],[3,1,4,1],[2,7,2,17]]}
[]
[null,"ADHÉRENTS  NOUVELLE  AQUITAINE  2017 - 2018"]
[null,null,null,null,null,null,null,"DORDOGNE (24)"]
[null,"CLUBS","S65","S50",null,"U20","U18","U16","U14","U12","U10","U8","Total","TF","S65","S50",null,"U20","U18","U16","U14","U12","U10","U8","Total","TM ","TOTAL","Var."]
[null,null,"VF","SF+","SF","JF","CF","MF","BF","PuF","PoF","PpF","JeunesF",null,"VM","SM+","SM","JM","CM","MM","BM","PuM","PoM","PpM","JeunesM"]
[null," Cercle d'Échecs Cyrano",{"$f":"'FEUILLE de SAISIE'!D7","v":1},{"$f":"'FEUILLE de SAISIE'!E7","v":0},{"$f":"'FEUILLE de SAISIE'!F7","v":0},{"$f":"'FEUILLE de SAISIE'!G7","v":0},{"$f":"'FEUILLE de SAISIE'!H7","v":0},{"$f":"'FEUILLE de SAISIE'!I7","v":0},{"$f":"'FEUILLE de SAISIE'!J7","v":0},{"$f":"'FEUILLE de SAISIE'!K7","v":0},{"$f":"'FEUILLE de SAISIE'!L7","v":0},{"$f":"'FEUILLE de SAISIE'!M7","v":1},{"$f":"SUM(F6:L6)","v":1},{"$f":"SUM(C6:L6)","v":2},{"$f":"'FEUILLE de SAISIE'!N7","v":9},{"$f":"'FEUILLE de SAISIE'!O7","v":5},{"$f":"'FEUILLE de SAISIE'!P7","v":5},{"$f":"'FEUILLE de SAISIE'!Q7","v":0},{"$f":"'FEUILLE de SAISIE'!R7","v":0},{"$f":"'FEUILLE de SAISIE'!S7","v":0},{"$f":"'FEUILLE de SAISIE'!T7","v":1},{"$f":"'FEUILLE de SAISIE'!U7","v":0},{"$f":"'FEUILLE de SAISIE'!V7","v":1},{"$f":"'FEUILLE de SAISIE'!W7","v":0},{"$f":"SUM(R6:X6)","v":2},{"$f":"SUM(O6:X6)","v":21},{"$f":"N6+Z6","v":23},{"$f":"AA6-15","v":8}]
[null," Le Fleix-LaTour Infernale (ALAC)",{"$f":"'FEUILLE de SAISIE'!D9","v":0},{"$f":"'FEUILLE de SAISIE'!E9","v":0},{"$f":"'FEUILLE de SAISIE'!F9","v":1},{"$f":"'FEUILLE de SAISIE'!G9","v":0},{"$f":"'FEUILLE de SAISIE'!H9","v":0},{"$f":"'FEUILLE de SAISIE'!I9","v":0},{"$f":"'FEUILLE de SAISIE'!J9","v":0},{"$f":"'FEUILLE de SAISIE'!K9","v":0},{"$f":"'FEUILLE de SAISIE'!L9","v":0},{"$f":"'FEUILLE de SAISIE'!M9","v":0},{"$f":"SUM(F7:L7)","v":0},{"$f":"SUM(C7:L7)","v":1},{"$f":"'FEUILLE de SAISIE'!N9","v":7},{"$f":"'FEUILLE de SAISIE'!O9","v":4},{"$f":"'FEUILLE de SAISIE'!P9","v":4},{"$f":"'FEUILLE de SAISIE'!Q9","v":0},{"$f":"'FEUILLE de SAISIE'!R9","v":0},{"$f":"'FEUILLE de SAISIE'!S9","v":0},{"$f":"'FEUILLE de SAISIE'!T9","v":0},{"$f":"'FEUILLE de SAISIE'!U9","v":0},{"$f":"'FEUILLE de SAISIE'!V9","v":0},{"$f":"'FEUILLE de SAISIE'!W9","v":0},{"$f":"SUM(R7:X7)","v":0},{"$f":"SUM(O7:X7)","v":15},{"$f":"N7+Z7","v":16},{"$f":"AA7-15","v":1}]
[null," Échiquier du Nontronnais",{"$f":"'FEUILLE de SAISIE'!D13","v":0},{"$f":"'FEUILLE de SAISIE'!E13","v":4},{"$f":"'FEUILLE de SAISIE'!F13","v":1},{"$f":"'FEUILLE de SAISIE'!G13","v":0},{"$f":"'FEUILLE de SAISIE'!H13","v":0},{"$f":"'FEUILLE de SAISIE'!I13","v":0},{"$f":"'FEUILLE de SAISIE'!J13","v":2},{"$f":"'FEUILLE de SAISIE'!K13","v":2},{"$f":"'FEUILLE de SAISIE'!L13","v":1},{"$f":"'FEUILLE de SAISIE'!M13","v":0},5,10,{"$f":"'FEUILLE de SAISIE'!N13","v":3},{"$f":"'FEUILLE de SAISIE'!O13","v":9},{"$f":"'FEUILLE de SAISIE'!P13","v":9},{"$f":"'FEUILLE de SAISIE'!Q13","v":0},{"$f":"'FEUILLE de SAISIE'!R13","v":1},{"$f":"'FEUILLE de SAISIE'!S13","v":0},{"$f":"'FEUILLE de SAISIE'!T13","v":1},{"$f":"'FEUILLE de SAISIE'!U13","v":6},{"$f":"'FEUILLE de SAISIE'!V13","v":1},{"$f":"'FEUILLE de SAISIE'!W13","v":2},11,32,42,{"$f":"AA8-23","v":19}]
[null," Échiquier Salignacois",{"$f":"'FEUILLE de SAISIE'!D15","v":0},{"$f":"'FEUILLE de SAISIE'!E15","v":0},{"$f":"'FEUILLE de SAISIE'!F15","v":0},{"$f":"'FEUILLE de SAISIE'!G15","v":0},{"$f":"'FEUILLE de SAISIE'!H15","v":0},{"$f":"'FEUILLE de SAISIE'!I15","v":1},{"$f":"'FEUILLE de SAISIE'!J15","v":1},{"$f":"'FEUILLE de SAISIE'!K15","v":2},{"$f":"'FEUILLE de SAISIE'!L15","v":1},{"$f":"'FEUILLE de SAISIE'!M15","v":1},6,6,{"$f":"'FEUILLE de SAISIE'!N15","v":0},{"$f":"'FEUILLE de SAISIE'!O15","v":1},{"$f":"'FEUILLE de SAISIE'!P15","v":3},{"$f":"'FEUILLE de SAISIE'!Q15","v":0},{"$f":"'FEUILLE de SAISIE'!R15","v":2},{"$f":"'FEUILLE de SAISIE'!S15","v":9},{"$f":"'FEUILLE de SAISIE'!T15","v":3},{"$f":"'FEUILLE de SAISIE'!U15","v":5},{"$f":"'FEUILLE de SAISIE'!V15","v":4},{"$f":"'FEUILLE de SAISIE'!W15","v":0},23,27,33,{"$f":"AA9-53","v":-20}]
[null," L' Échiquier de Saint Sour",{"$f":"'FEUILLE de SAISIE'!D17","v":0},{"$f":"'FEUILLE de SAISIE'!E17","v":1},{"$f":"'FEUILLE de SAISIE'!F17","v":0},{"$f":"'FEUILLE de SAISIE'!G17","v":0},{"$f":"'FEUILLE de SAISIE'!H17","v":0},{"$f":"'FEUILLE de SAISIE'!I17","v":0},{"$f":"'FEUILLE de SAISIE'!J17","v":0},{"$f":"'FEUILLE de SAISIE'!K17","v":0},{"$f":"'FEUILLE de SAISIE'!L17","v":0},{"$f":"'FEUILLE de SAISIE'!M17","v":1},1,2,{"$f":"'FEUILLE de SAISIE'!N17","v":0},{"$f":"'FEUILLE de SAISIE'!O17","v":0},{"$f":"'FEUILLE de SAISIE'!P17","v":1},{"$f":"'FEUILLE de SAISIE'!Q17","v":0},{"$f":"'FEUILLE de SAISIE'!R17","v":0},{"$f":"'FEUILLE de SAISIE'!S17","v":0},{"$f":"'FEUILLE de SAISIE'!T17","v":1},{"$f":"'FEUILLE de SAISIE'!U17","v":0},{"$f":"'FEUILLE de SAISIE'!V17","v":0},{"$f":"'FEUILLE de SAISIE'!W17","v":0},1,2,4,{"$f":"AA10-68","v":-64}]
[null," TOTAUX CDJE 24",{"$f":"SUM(C6:C10)","v":1},{"$f":"SUM(D6:D10)","v":5},2,0,0,1,3,4,2,{"$f":"SUM(L6:L10)","v":3},13,21,19,19,22,0,3,9,6,11,6,2,37,97,{"$f":"SUM(AA6:AA10)","v":118},{"$f":"SUM(AB6:AB10)","v":-56}]

{"sheet":"33","index":1,"n_rows":19,"n_cols":28,"rows_kept":19,"cut":false,"hidden":false,"merged":[[1,1,1,27],[3,27,4,27],[2,8,2,14],[3,13,4,13],[3,25,4,25],[3,26,4,26],[3,1,4,1]]}
[]
[null,"ADHÉRENTS  NOUVELLE  AQUITAINE  2017 - 2018"]
[null,null,null,null,null,null,null,null,"GIRONDE (33)"]
[null,"CLUBS","S65","S50",null,"U20","U18","U16","U14","U12","U10","U8","Total","TF","S65","S50",null,"U20","U18","U16","U14","U12","U10","U8","Total","TM ","TOTAL","Var."]
[null,null,"VF","SF+","SF","JF","CF","MF","BF","PuF","PoF","PpF","JeunesF",null,"VM","SM+","SM","JM","CM","MM","BM","PuM","PoM","PpM","JeunesM"]
[null," AGJA-Échiquier Aquitaine",{"$f":"'FEUILLE de SAISIE'!D24","v":2},{"$f":"'FEUILLE de SAISIE'!E24","v":3},{"$f":"'FEUILLE de SAISIE'!F24","v":4},{"$f":"'FEUILLE de SAISIE'!G24","v":2},{"$f":"'FEUILLE de SAISIE'!H24","v":2},{"$f":"'FEUILLE de SAISIE'!I24","v":1},{"$f":"'FEUILLE de SAISIE'!J24","v":1},{"$f":"'FEUILLE de SAISIE'!K24","v":1},{"$f":"'FEUILLE de SAISIE'!L24","v":5},{"$f":"'FEUILLE de SAISIE'!M24","v":4},{"$f":"SUM(F6:L6)","v":16},{"$f":"SUM(C6:L6)","v":25},{"$f":"'FEUILLE de SAISIE'!N24","v":16},{"$f":"'FEUILLE de SAISIE'!O24","v":9},{"$f":"'FEUILLE de SAISIE'!P24","v":19},{"$f":"'FEUILLE de SAISIE'!Q24","v":4},{"$f":"'FEUILLE de SAISIE'!R24","v":2},{"$f":"'FEUILLE de SAISIE'!S24","v":3},{"$f":"'FEUILLE de SAISIE'!T24","v":10},{"$f":"'FEUILLE de SAISIE'!U24","v":14},{"$f":"'FEUILLE de SAISIE'!V24","v":17},{"$f":"'FEUILLE de SAISIE'!W24","v":9},{"$f":"SUM(R6:X6)","v":59},{"$f":"SUM(O6:X6)","v":103},{"$f":"N6+Z6","v":128},{"$f":"AA6-136","v":-8}]
[null," Bordeaux-ASPOM Échecs",{"$f":"'FEUILLE de SAISIE'!D30","v":1},{"$f":"'FEUILLE de SAISIE'!E30","v":1},{"$f":"'FEUILLE de SAISIE'!F30","v":0},{"$f":"'FEUILLE de SAISIE'!G30","v":1},{"$f":"'FEUILLE de SAISIE'!H30","v":0},{"$f":"'FEUILLE de SAISIE'!I30","v":3},{"$f":"'FEUILLE de SAISIE'!J30","v":7},{"$f":"'FEUILLE de SAISIE'!K30","v":7},{"$f":"'FEUILLE de SAISIE'!L30","v":8},{"$f":"'FEUILLE de SAISIE'!M30","v":5},{"$f":"SUM(F7:L7)","v":31},{"$f":"SUM(C7:L7)","v":33},{"$f":"'FEUILLE de SAISIE'!N30","v":7},{"$f":"'FEUILLE de SAISIE'!O30","v":17},{"$f":"'FEUILLE de SAISIE'!P30","v":28},{"$f":"'FEUILLE de SAISIE'!Q30","v":1},{"$f":"'FEUILLE de SAISIE'!R30","v":0},{"$f":"'FEUILLE de SAISIE'!S30","v":5},{"$f":"'FEUILLE de SAISIE'!T30","v":12},{"$f":"'FEUILLE de SAISIE'!U30","v":8},{"$f":"'FEUILLE de SAISIE'!V30","v":18},{"$f":"'FEUILLE de SAISIE'!W30","v":13},{"$f":"SUM(R7:X7)","v":57},{"$f":"SUM(O7:X7)","v":109},{"$f":"N7+Z7","v":142},{"$f":"AA7-183","v":-41}]
[null," Union Saint Bruno-Bordeaux Échecs",{"$f":"'FEUILLE de SAISIE'!D35","v":0},{"$f":"'FEUILLE de SAISIE'!E35","v":1},{"$f":"'FEUILLE de SAISIE'!F35","v":1},{"$f":"'FEUILLE de SAISIE'!G35","v":0},{"$f":"'FEUILLE de SAISIE'!H35","v":1},{"$f":"'FEUILLE de SAISIE'!I35","v":1},{"$f":"'FEUILLE de SAISIE'!J35","v":1},{"$f":"'FEUILLE de SAISIE'!K35","v":6},{"$f":"'FEUILLE de SAISIE'!L35","v":14},{"$f":"'FEUILLE de SAISIE'!M35","v":5},28,30,{"$f":"'FEUILLE de SAISIE'!N35","v":0},{"$f":"'FEUILLE de SAISIE'!O35","v":7},{"$f":"'FEUILLE de SAISIE'!P35","v":10},{"$f":"'FEUILLE de SAISIE'!Q35","v":0},{"$f":"'FEUILLE de SAISIE'!R35","v":4},{"$f":"'FEUILLE de SAISIE'!S35","v":4},{"$f":"'FEUILLE de SAISIE'!T35","v":3},{"$f":"'FEUILLE de SAISIE'!U35","v":9},{"$f":"'FEUILLE de SAISIE'!V35","v":34},{"$f":"'FEUILLE de SAISIE'!W35","v":11},65,82,112,{"$f":"AA8-116","v":-4}]
[null," Échiquier  Bordelais",{"$f":"'FEUILLE de SAISIE'!D45","v":1},{"$f":"'FEUILLE de SAISIE'!E45","v":3},{"$f":"'FEUILLE de SAISIE'!F45","v":1},{"$f":"'FEUILLE de SAISIE'!G45","v":1},{"$f":"'FEUILLE de SAISIE'!H45","v":2},{"$f":"'FEUILLE de SAISIE'!I45","v":0},{"$f":"'FEUILLE de SAISIE'!J45","v":0},{"$f":"'FEUILLE de SAISIE'!K45","v":5},{"$f":"'FEUILLE de SAISIE'!L45","v":12},{"$f":"'FEUILLE de SAISIE'!M45","v":18},{"$f":"SUM(F9:L9)","v":38},{"$f":"SUM(C9:L9)","v":43},{"$f":"'FEUILLE de SAISIE'!N45","v":13},{"$f":"'FEUILLE de SAISIE'!O45","v":19},{"$f":"'FEUILLE de SAISIE'!P45","v":46},{"$f":"'FEUILLE de SAISIE'!Q45","v":5},{"$f":"'FEUILLE de SAISIE'!R45","v":7},{"$f":"'FEUILLE de SAISIE'!S45","v":8},{"$f":"'FEUILLE de SAISIE'!T45","v":11},{"$f":"'FEUILLE de SAISIE'!U45","v":46},{"$f":"'FEUILLE de SAISIE'!V45","v":61},{"$f":"'FEUILLE de SAISIE'!W45","v":46},184,262,305,{"$f":"AA9-349","v":-44}]
[null,"  Échiquier Albert Le Grand",{"$f":"'FEUILLE de SAISIE'!D56","v":0},{"$f":"'FEUILLE de SAISIE'!E56","v":1},{"$f":"'FEUILLE de SAISIE'!F56","v":3},{"$f":"'FEUILLE de SAISIE'!G56","v":0},{"$f":"'FEUILLE de SAISIE'!H56","v":0},{"$f":"'FEUILLE de SAISIE'!I56","v":4},{"$f":"'FEUILLE de SAISIE'!J56","v":8},{"$f":"'FEUILLE de SAISIE'!K56","v":27},{"$f":"'FEUILLE de SAISIE'!L56","v":22},{"$f":"'FEUILLE de SAISIE'!M56","v":19},80,84,{"$f":"'FEUILLE de SAISIE'!N56","v":0},{"$f":"'FEUILLE de SAISIE'!O56","v":1},{"$f":"'FEUILLE de SAISIE'!P56","v":7},{"$f":"'FEUILLE de SAISIE'!Q56","v":1},{"$f":"'FEUILLE de SAISIE'!R56","v":5},{"$f":"'FEUILLE de SAISIE'!S56","v":16},{"$f":"'FEUILLE de SAISIE'!T56","v":19},{"$f":"'FEUILLE de SAISIE'!U56","v":60},{"$f":"'FEUILLE de SAISIE'!V56","v":72},{"$f":"'FEUILLE de SAISIE'!W56","v":30},203,211,295,{"$f":"AA10-50","v":245}]
[null," Échiquier Club Créonnais",{"$f":"'FEUILLE de SAISIE'!D61","v":1},{"$f":"'FEUILLE de SAISIE'!E61","v":1},{"$f":"'FEUILLE de SAISIE'!F61","v":4},{"$f":"'FEUILLE de SAISIE'!G61","v":0},{"$f":"'FEUILLE de SAISIE'!H61","v":0},{"$f":"'FEUILLE de SAISIE'!I61","v":0},{"$f":"'FEUILLE de SAISIE'!J61","v":3},{"$f":"'FEUILLE de SAISIE'!K61","v":4},{"$f":"'FEUILLE de SAISIE'!L61","v":5},{"$f":"'FEUILLE de SAISIE'!M61","v":2},14,20,{"$f":"'FEUILLE de SAISIE'!N61","v":9},{"$f":"'FEUILLE de SAISIE'!O61","v":11},{"$f":"'FEUILLE de SAISIE'!P61","v":8},{"$f":"'FEUILLE de SAISIE'!Q61","v":0},{"$f":"'FEUILLE de SAISIE'!R61","v":1},{"$f":"'FEUILLE de SAISIE'!S61","v":1},{"$f":"'FEUILLE de SAISIE'!T61","v":8},{"$f":"'FEUILLE de SAISIE'!U61","v":10},{"$f":"'FEUILLE de SAISIE'!V61","v":11},{"$f":"'FEUILLE de SAISIE'!W61","v":9},40,68,88,{"$f":"AA11-244","v":-156}]
[null," Gujan-Mestras Échecs",{"$f":"'FEUILLE de SAISIE'!D65","v":0},{"$f":"'FEUILLE de SAISIE'!E65","v":0},{"$f":"'FEUILLE de SAISIE'!F65","v":2},{"$f":"'FEUILLE de SAISIE'!G65","v":0},{"$f":"'FEUILLE de SAISIE'!H65","v":0},{"$f":"'FEUILLE de SAISIE'!I65","v":0},{"$f":"'FEUILLE de SAISIE'!J65","v":2},{"$f":"'FEUILLE de SAISIE'!K65","v":0},{"$f":"'FEUILLE de SAISIE'!L65","v":0},{"$f":"'FEUILLE de SAISIE'!M65","v":1},3,5,{"$f":"'FEUILLE de SAISIE'!N65","v":10},{"$f":"'FEUILLE de SAISIE'!O65","v":11},{"$f":"'FEUILLE de SAISIE'!P65","v":10},{"$f":"'FEUILLE de SAISIE'!Q65","v":0},{"$f":"'FEUILLE de SAISIE'!R65","v":1},{"$f":"'FEUILLE de SAISIE'!S65","v":4},{"$f":"'FEUILLE de SAISIE'!T65","v":2},{"$f":"'FEUILLE de SAISIE'!U65","v":4},{"$f":"'FEUILLE de SAISIE'!V65","v":6},{"$f":"'FEUILLE de SAISIE'!W65","v":4},21,52,57,{"$f":"AA12-49","v":8}]
[null," Échiquier club Réolais",{"$f":"'FEUILLE de SAISIE'!D67","v":0},{"$f":"'FEUILLE de SAISIE'!E67","v":0},{"$f":"'FEUILLE de SAISIE'!F67","v":0},{"$f":"'FEUILLE de SAISIE'!G67","v":0},{"$f":"'FEUILLE de SAISIE'!H67","v":0},{"$f":"'FEUILLE de SAISIE'!I67","v":0},{"$f":"'FEUILLE de SAISIE'!J67","v":0},{"$f":"'FEUILLE de SAISIE'!K67","v":0},{"$f":"'FEUILLE de SAISIE'!L67","v":0},{"$f":"'FEUILLE de SAISIE'!M67","v":0},0,0,{"$f":"'FEUILLE de SAISIE'!N67","v":1},{"$f":"'FEUILLE de SAISIE'!O67","v":2},{"$f":"'FEUILLE de SAISIE'!P67","v":3},{"$f":"'FEUILLE de SAISIE'!Q67","v":0},{"$f":"'FEUILLE de SAISIE'!R67","v":0},{"$f":"'FEUILLE de SAISIE'!S67","v":1},{"$f":"'FEUILLE de SAISIE'!T67","v":3},{"$f":"'FEUILLE de SAISIE'!U67","v":0},{"$f":"'FEUILLE de SAISIE'!V67","v":1},{"$f":"'FEUILLE de SAISIE'!W67","v":1},6,12,12,{"$f":"AA13-13","v":-1}]
[null," Échiquier Médocain",{"$f":"'FEUILLE de SAISIE'!D72","v":1},{"$f":"'FEUILLE de SAISIE'!E72","v":3},{"$f":"'FEUILLE de SAISIE'!F72","v":3},{"$f":"'FEUILLE de SAISIE'!G72","v":0},{"$f":"'FEUILLE de SAISIE'!H72","v":0},{"$f":"'FEUILLE de SAISIE'!I72","v":0},{"$f":"'FEUILLE de SAISIE'!J72","v":1},{"$f":"'FEUILLE de SAISIE'!K72","v":0},{"$f":"'FEUILLE de SAISIE'!L72","v":0},{"$f":"'FEUILLE de SAISIE'!M72","v":0},1,8,{"$f":"'FEUILLE de SAISIE'!N72","v":2},{"$f":"'FEUILLE de SAISIE'!O72","v":7},{"$f":"'FEUILLE de SAISIE'!P72","v":13},{"$f":"'FEUILLE de SAISIE'!Q72","v":0},{"$f":"'FEUILLE de SAISIE'!R72","v":4},{"$f":"'FEUILLE de SAISIE'!S72","v":1},{"$f":"'FEUILLE de SAISIE'!T72","v":2},{"$f":"'FEUILLE de SAISIE'!U72","v":4},{"$f":"'FEUILLE de SAISIE'!V72","v":3},{"$f":"'FEUILLE de SAISIE'!W72","v":0},14,36,44,{"$f":"AA14-41","v":3}]
[null," Échiquier Libournais",{"$f":"'FEUILLE de SAISIE'!D78","v":3},{"$f":"'FEUILLE de SAISIE'!E78","v":2},{"$f":"'FEUILLE de SAISIE'!F78","v":2},{"$f":"'FEUILLE de SAISIE'!G78","v":0},{"$f":"'FEUILLE de SAISIE'!H78","v":0},{"$f":"'FEUILLE de SAISIE'!I78","v":1},{"$f":"'FEUILLE de SAISIE'!J78","v":10},{"$f":"'FEUILLE de SAISIE'!K78","v":8},{"$f":"'FEUILLE de SAISIE'!L78","v":8},{"$f":"'FEUILLE de SAISIE'!M78","v":1},28,35,{"$f":"'FEUILLE de SAISIE'!N78","v":6},{"$f":"'FEUILLE de SAISIE'!O78","v":5},{"$f":"'FEUILLE de SAISIE'!P78","v":6},{"$f":"'FEUILLE de SAISIE'!Q78","v":0},{"$f":"'FEUILLE de SAISIE'!R78","v":4},{"$f":"'FEUILLE de SAISIE'!S78","v":8},{"$f":"'FEUILLE de SAISIE'!T78","v":17},{"$f":"'FEUILLE de SAISIE'!U78","v":21},{"$f":"'FEUILLE de SAISIE'!V78","v":18},{"$f":"'FEUILLE de SAISIE'!W78","v":8},76,93,128,{"$f":"AA15-118","v":10}]
[null," Mérignac Échecs",{"$f":"'FEUILLE de SAISIE'!D80","v":0},{"$f":"'FEUILLE de SAISIE'!E80","v":0},{"$f":"'FEUILLE de SAISIE'!F80","v":1},{"$f":"'FEUILLE de SAISIE'!G80","v":0},{"$f":"'FEUILLE de SAISIE'!H80","v":0},{"$f":"'FEUILLE de SAISIE'!I80","v":0},{"$f":"'FEUILLE de SAISIE'!J80","v":0},{"$f":"'FEUILLE de SAISIE'!K80","v":0},{"$f":"'FEUILLE de SAISIE'!L80","v":0},{"$f":"'FEUILLE de SAISIE'!M80","v":0},0,1,{"$f":"'FEUILLE de SAISIE'!N80","v":2},{"$f":"'FEUILLE de SAISIE'!O80","v":4},{"$f":"'FEUILLE de SAISIE'!P80","v":2},{"$f":"'FEUILLE de SAISIE'!Q80","v":0},{"$f":"'FEUILLE de SAISIE'!R80","v":0},{"$f":"'FEUILLE de SAISIE'!S80","v":0},{"$f":"'FEUILLE de SAISIE'!T80","v":0},{"$f":"'FEUILLE de SAISIE'!U80","v":0},{"$f":"'FEUILLE de SAISIE'!V80","v":0},{"$f":"'FEUILLE de SAISIE'!W80","v":0},0,8,9,{"$f":"AA16-18","v":-9}]
[null," Parempuyre Échecs",{"$f":"'FEUILLE de SAISIE'!D82","v":0},{"$f":"'FEUILLE de SAISIE'!E82","v":1},{"$f":"'FEUILLE de SAISIE'!F82","v":1},{"$f":"'FEUILLE de SAISIE'!G82","v":1},{"$f":"'FEUILLE de SAISIE'!H82","v":0},{"$f":"'FEUILLE de SAISIE'!I82","v":2},{"$f":"'FEUILLE de SAISIE'!J82","v":0},{"$f":"'FEUILLE de SAISIE'!K82","v":1},{"$f":"'FEUILLE de SAISIE'!L82","v":0},{"$f":"'FEUILLE de SAISIE'!M82","v":1},5,7,{"$f":"'FEUILLE de SAISIE'!N82","v":2},{"$f":"'FEUILLE de SAISIE'!O82","v":5},{"$f":"'FEUILLE de SAISIE'!P82","v":4},{"$f":"'FEUILLE de SAISIE'!Q82","v":1},{"$f":"'FEUILLE de SAISIE'!R82","v":6},{"$f":"'FEUILLE de SAISIE'!S82","v":1},{"$f":"'FEUILLE de SAISIE'!T82","v":4},{"$f":"'FEUILLE de SAISIE'!U82","v":1},{"$f":"'FEUILLE de SAISIE'!V82","v":0},{"$f":"'FEUILLE de SAISIE'!W82","v":1},14,25,32,{"$f":"AA17-48","v":-16}]
[null," Échiquier Tressois",{"$f":"'FEUILLE de SAISIE'!D87","v":0},{"$f":"'FEUILLE de SAISIE'!E87","v":0},{"$f":"'FEUILLE de SAISIE'!F87","v":0},{"$f":"'FEUILLE de SAISIE'!G87","v":0},{"$f":"'FEUILLE de SAISIE'!H87","v":0},{"$f":"'FEUILLE de SAISIE'!I87","v":0},{"$f":"'FEUILLE de SAISIE'!J87","v":2},{"$f":"'FEUILLE de SAISIE'!K87","v":3},{"$f":"'FEUILLE de SAISIE'!L87","v":2},{"$f":"'FEUILLE de SAISIE'!M87","v":3},10,10,{"$f":"'FEUILLE de SAISIE'!N87","v":6},{"$f":"'FEUILLE de SAISIE'!O87","v":10},{"$f":"'FEUILLE de SAISIE'!P87","v":16},{"$f":"'FEUILLE de SAISIE'!Q87","v":1},{"$f":"'FEUILLE de SAISIE'!R87","v":2},{"$f":"'FEUILLE de SAISIE'!S87","v":8},{"$f":"'FEUILLE de SAISIE'!T87","v":8},{"$f":"'FEUILLE de SAISIE'!U87","v":17},{"$f":"'FEUILLE de SAISIE'!V87","v":14},{"$f":"'FEUILLE de SAISIE'!W87","v":9},59,91,101,{"$f":"AA18-62","v":39}]
[null," TOTAUX CDJE 33",{"$f":"SUM(C6:C18)","v":9},{"$f":"SUM(D6:D18)","v":16},22,5,5,12,35,62,76,59,254,301,74,{"$f":"SUM(P6:P18)","v":108},172,13,36,60,99,194,255,141,798,1152,1453,{"$f":"SUM(AB6:AB18)","v":26}]

{"sheet":"40","index":2,"n_rows":10,"n_cols":28,"rows_kept":10,"cut":false,"hidden":false,"merged":[[1,1,1,27],[3,27,4,27],[2,8,2,14],[3,13,4,13],[3,25,4,25],[3,26,4,26],[3,1,4,1]]}
[]
[null,"ADHÉRENTS  NOUVELLE  AQUITAINE  2017 - 2018"]
[null,null,null,null,null,null,null,null,"LANDES (40)"]
[null,"CLUBS","S65","S50",null,"U20","U18","U16","U14","U12","U10","U8","Total","TF","S65","S50",null,"U20","U18","U16","U14","U12","U10","U8","Total","TM ","TOTAL","Var."]
[null,null,"VF","SF+","SF","JF","CF","MF","BF","PuF","PoF","PpF","JeunesF",null,"VM","SM+","SM","JM","CM","MM","BM","PuM","PoM","PpM","JeunesM"]
[null," Dax Échiquier Dacquois",{"$f":"'FEUILLE de SAISIE'!D90","v":0},{"$f":"'FEUILLE de SAISIE'!E90","v":0},{"$f":"'FEUILLE de SAISIE'!F90","v":0},{"$f":"'FEUILLE de SAISIE'!G90","v":0},{"$f":"'FEUILLE de SAISIE'!H90","v":0},{"$f":"'FEUILLE de SAISIE'!I90","v":0},{"$f":"'FEUILLE de SAISIE'!J90","v":0},{"$f":"'FEUILLE de SAISIE'!K90","v":0},{"$f":"'FEUILLE de SAISIE'!L90","v":1},{"$f":"'FEUILLE de SAISIE'!M90","v":0},{"$f":"SUM(F6:L6)","v":1},{"$f":"SUM(C6:L6)","v":1},{"$f":"'FEUILLE de SAISIE'!N90","v":15},{"$f":"'FEUILLE de SAISIE'!O90","v":1},{"$f":"'FEUILLE de SAISIE'!P90","v":2},{"$f":"'FEUILLE de SAISIE'!Q90","v":0},{"$f":"'FEUILLE de SAISIE'!R90","v":1},{"$f":"'FEUILLE de SAISIE'!S90","v":0},{"$f":"'FEUILLE de SAISIE'!T90","v":1},{"$f":"'FEUILLE de SAISIE'!U90","v":4},{"$f":"'FEUILLE de SAISIE'!V90","v":2},{"$f":"'FEUILLE de SAISIE'!W90","v":0},{"$f":"SUM(R6:X6)","v":8},{"$f":"SUM(O6:X6)","v":26},{"$f":"N6+Z6","v":27},{"$f":"AA6-31","v":-4}]
[null," Mimizan le Fou Ensablé (ASEM)",{"$f":"'FEUILLE de SAISIE'!D92","v":1},{"$f":"'FEUILLE de SAISIE'!E92","v":1},{"$f":"'FEUILLE de SAISIE'!F92","v":0},{"$f":"'FEUILLE de SAISIE'!G92","v":0},{"$f":"'FEUILLE de SAISIE'!H92","v":0},{"$f":"'FEUILLE de SAISIE'!I92","v":0},{"$f":"'FEUILLE de SAISIE'!J92","v":0},{"$f":"'FEUILLE de SAISIE'!K92","v":0},{"$f":"'FEUILLE de SAISIE'!L92","v":0},{"$f":"'FEUILLE de SAISIE'!M92","v":0},{"$f":"SUM(F7:L7)","v":0},{"$f":"SUM(C7:L7)","v":2},{"$f":"'FEUILLE de SAISIE'!N92","v":4},{"$f":"'FEUILLE de SAISIE'!O92","v":7},{"$f":"'FEUILLE de SAISIE'!P92","v":3},{"$f":"'FEUILLE de SAISIE'!Q92","v":0},{"$f":"'FEUILLE de SAISIE'!R92","v":0},{"$f":"'FEUILLE de SAISIE'!S92","v":1},{"$f":"'FEUILLE de SAISIE'!T92","v":0},{"$f":"'FEUILLE de SAISIE'!U92","v":0},{"$f":"'FEUILLE de SAISIE'!V92","v":0},{"$f":"'FEUILLE de SAISIE'!W92","v":0},{"$f":"SUM(R7:X7)","v":1},{"$f":"SUM(O7:X7)","v":15},{"$f":"N7+Z7","v":17},{"$f":"AA7-11","v":6}]
[null," Échiquier Montois",{"$f":"'FEUILLE de SAISIE'!D100","v":0},{"$f":"'FEUILLE de SAISIE'!E100","v":2},{"$f":"'FEUILLE de SAISIE'!F100","v":4},{"$f":"'FEUILLE de SAISIE'!G100","v":0},{"$f":"'FEUILLE de SAISIE'!H100","v":2},{"$f":"'FEUILLE de SAISIE'!I100","v":0},{"$f":"'FEUILLE de SAISIE'!J100","v":14},{"$f":"'FEUILLE de SAISIE'!K100","v":18},{"$f":"'FEUILLE de SAISIE'!L100","v":11},{"$f":"'FEUILLE de SAISIE'!M100","v":1},{"$f":"SUM(F8:L8)","v":46},52,{"$f":"'FEUILLE de SAISIE'!N100","v":4},{"$f":"'FEUILLE de SAISIE'!O100","v":14},{"$f":"'FEUILLE de SAISIE'!P100","v":11},{"$f":"'FEUILLE de SAISIE'!Q100","v":0},{"$f":"'FEUILLE de SAISIE'!R100","v":1},{"$f":"'FEUILLE de SAISIE'!S100","v":12},{"$f":"'FEUILLE de SAISIE'!T100","v":37},{"$f":"'FEUILLE de SAISIE'!U100","v":53},{"$f":"'FEUILLE de SAISIE'!V100","v":27},{"$f":"'FEUILLE de SAISIE'!W100","v":4},134,163,215,{"$f":"AA8-241","v":-26}]
[null," Hossegor Échecs",{"$f":"'FEUILLE de SAISIE'!D102","v":1},{"$f":"'FEUILLE de SAISIE'!E102","v":2},{"$f":"'FEUILLE de SAISIE'!F102","v":1},{"$f":"'FEUILLE de SAISIE'!G102","v":0},{"$f":"'FEUILLE de SAISIE'!H102","v":0},{"$f":"'FEUILLE de SAISIE'!I102","v":0},{"$f":"'FEUILLE de SAISIE'!J102","v":1},{"$f":"'FEUILLE de SAISIE'!K102","v":0},{"$f":"'FEUILLE de SAISIE'!L102","v":0},{"$f":"'FEUILLE de SAISIE'!M102","v":0},{"$f":"SUM(F9:L9)","v":1},5,{"$f":"'FEUILLE de SAISIE'!N102","v":8},{"$f":"'FEUILLE de SAISIE'!O102","v":6},{"$f":"'FEUILLE de SAISIE'!P102","v":5},{"$f":"'FEUILLE de SAISIE'!Q102","v":1},{"$f":"'FEUILLE de SAISIE'!R102","v":0},{"$f":"'FEUILLE de SAISIE'!S102","v":1},{"$f":"'FEUILLE de SAISIE'!T102","v":2},{"$f":"'FEUILLE de SAISIE'!U102","v":1},{"$f":"'FEUILLE de SAISIE'!V102","v":1},{"$f":"'FEUILLE de SAISIE'!W102","v":0},6,25,30,{"$f":"AA9-34","v":-4}]
[null," TOTAUX CDJE 40",{"$f":"SUM(C6:C9)","v":2},{"$f":"SUM(D6:D9)","v":5},{"$f":"SUM(E6:E9)","v":5},0,2,0,15,18,12,1,48,60,31,28,21,1,2,14,40,58,30,4,149,{"$f":"SUM(Z6:Z9)","v":229},289,{"$f":"SUM(AB6:AB9)","v":-28}]

{"sheet":"47","index":3,"n_rows":10,"n_cols":28,"rows_kept":10,"cut":false,"hidden":false,"merged":[[1,1,1,27],[3,27,4,27],[3,13,4,13],[3,25,4,25],[3,26,4,26],[2,8,2,15],[3,1,4,1]]}
[]
[null,"ADHÉRENTS  NOUVELLE  AQUITAINE  2017 - 2018"]
[null,null,null,null,null,null,null,null,"LOT  ET  GARONNE (47)"]
[null,"CLUBS","S65","S50",null,"U20","U18","U16","U14","U12","U10","U8","Total","TF","S65","S50",null,"U20","U18","U16","U14","U12","U10","U8","Total","TM ","TOTAL","Var."]
[null,null,"VF","SF+","SF","JF","CF","MF","BF","PuF","PoF","PpF","JeunesF",null,"VM","SM+","SM","JM","CM","MM","BM","PuM","PoM","PpM","JeunesM"]
[null," Échiquier Agenais",{"$f":"'FEUILLE de SAISIE'!D109","v":0},{"$f":"'FEUILLE de SAISIE'!E109","v":1},{"$f":"'FEUILLE de SAISIE'!F109","v":8},{"$f":"'FEUILLE de SAISIE'!G109","v":0},{"$f":"'FEUILLE de SAISIE'!H109","v":0},{"$f":"'FEUILLE de SAISIE'!I109","v":0},{"$f":"'FEUILLE de SAISIE'!J109","v":2},{"$f":"'FEUILLE de SAISIE'!K109","v":2},{"$f":"'FEUILLE de SAISIE'!L109","v":6},{"$f":"'FEUILLE de SAISIE'!M109","v":4},{"$f":"SUM(F6:L6)","v":14},{"$f":"SUM(C6:L6)","v":23},{"$f":"'FEUILLE de SAISIE'!N109","v":3},{"$f":"'FEUILLE de SAISIE'!O109","v":12},{"$f":"'FEUILLE de SAISIE'!P109","v":26},{"$f":"'FEUILLE de SAISIE'!Q109","v":0},{"$f":"'FEUILLE de SAISIE'!R109","v":2},{"$f":"'FEUILLE de SAISIE'!S109","v":6},{"$f":"'FEUILLE de SAISIE'!T109","v":6},{"$f":"'FEUILLE de SAISIE'!U109","v":16},{"$f":"'FEUILLE de SAISIE'!V109","v":20},{"$f":"'FEUILLE de SAISIE'!W109","v":14},{"$f":"SUM(R6:X6)","v":64},{"$f":"SUM(O6:X6)","v":105},{"$f":"N6+Z6","v":128},{"$f":"AA6-139","v":-11}]
[null," Échiquier Marmandais",{"$f":"'FEUILLE de SAISIE'!D111","v":1},{"$f":"'FEUILLE de SAISIE'!E111","v":0},{"$f":"'FEUILLE de SAISIE'!F111","v":0},{"$f":"'FEUILLE de SAISIE'!G111","v":0},{"$f":"'FEUILLE de SAISIE'!H111","v":0},{"$f":"'FEUILLE de SAISIE'!I111","v":0},{"$f":"'FEUILLE de SAISIE'!J111","v":0},{"$f":"'FEUILLE de SAISIE'!K111","v":2},{"$f":"'FEUILLE de SAISIE'!L111","v":0},{"$f":"'FEUILLE de SAISIE'!M111","v":0},{"$f":"SUM(F7:L7)","v":2},{"$f":"SUM(C7:L7)","v":3},{"$f":"'FEUILLE de SAISIE'!N111","v":2},{"$f":"'FEUILLE de SAISIE'!O111","v":3},{"$f":"'FEUILLE de SAISIE'!P111","v":2},{"$f":"'FEUILLE de SAISIE'!Q111","v":0},{"$f":"'FEUILLE de SAISIE'!R111","v":0},{"$f":"'FEUILLE de SAISIE'!S111","v":0},{"$f":"'FEUILLE de SAISIE'!T111","v":1},{"$f":"'FEUILLE de SAISIE'!U111","v":3},{"$f":"'FEUILLE de SAISIE'!V111","v":0},{"$f":"'FEUILLE de SAISIE'!W111","v":0},{"$f":"SUM(R7:X7)","v":4},{"$f":"SUM(O7:X7)","v":11},{"$f":"N7+Z7","v":14},{"$f":"AA7-23","v":-9}]
[null," Club des Échecs du Pays de Lauzun",{"$f":"'FEUILLE de SAISIE'!D113","v":2},{"$f":"'FEUILLE de SAISIE'!E113","v":3},{"$f":"'FEUILLE de SAISIE'!F113","v":1},{"$f":"'FEUILLE de SAISIE'!G113","v":0},{"$f":"'FEUILLE de SAISIE'!H113","v":0},{"$f":"'FEUILLE de SAISIE'!I113","v":0},{"$f":"'FEUILLE de SAISIE'!J113","v":0},{"$f":"'FEUILLE de SAISIE'!K113","v":0},{"$f":"'FEUILLE de SAISIE'!L113","v":0},{"$f":"'FEUILLE de SAISIE'!M113","v":0},0,6,{"$f":"'FEUILLE de SAISIE'!N113","v":8},{"$f":"'FEUILLE de SAISIE'!O113","v":3},{"$f":"'FEUILLE de SAISIE'!P113","v":3},{"$f":"'FEUILLE de SAISIE'!Q113","v":0},{"$f":"'FEUILLE de SAISIE'!R113","v":1},{"$f":"'FEUILLE de SAISIE'!S113","v":0},{"$f":"'FEUILLE de SAISIE'!T113","v":0},{"$f":"'FEUILLE de SAISIE'!U113","v":1},{"$f":"'FEUILLE de SAISIE'!V113","v":2},{"$f":"'FEUILLE de SAISIE'!W113","v":0},4,18,24,0]
[null," L'Échiquier Villeneuvois",{"$f":"'FEUILLE de SAISIE'!D117","v":0},{"$f":"'FEUILLE de SAISIE'!E117","v":3},{"$f":"'FEUILLE de SAISIE'!F117","v":2},{"$f":"'FEUILLE de SAISIE'!G117","v":0},{"$f":"'FEUILLE de SAISIE'!H117","v":0},{"$f":"'FEUILLE de SAISIE'!I117","v":0},{"$f":"'FEUILLE de SAISIE'!J117","v":1},{"$f":"'FEUILLE de SAISIE'!K117","v":1},{"$f":"'FEUILLE de SAISIE'!L117","v":2},{"$f":"'FEUILLE de SAISIE'!M117","v":2},6,11,{"$f":"'FEUILLE de SAISIE'!N117","v":2},{"$f":"'FEUILLE de SAISIE'!O117","v":8},{"$f":"'FEUILLE de SAISIE'!P117","v":11},{"$f":"'FEUILLE de SAISIE'!Q117","v":0},{"$f":"'FEUILLE de SAISIE'!R117","v":0},{"$f":"'FEUILLE de SAISIE'!S117","v":3},{"$f":"'FEUILLE de SAISIE'!T117","v":4},{"$f":"'FEUILLE de SAISIE'!U117","v":11},{"$f":"'FEUILLE de SAISIE'!V117","v":6},{"$f":"'FEUILLE de SAISIE'!W117","v":6},30,51,62,{"$f":"AA9-53","v":9}]
[null," TOTAUX CDJE 47",{"$f":"SUM(C6:C9)","v":3},{"$f":"SUM(D6:D9)","v":7},11,0,0,0,3,5,8,6,22,43,15,26,42,0,3,9,11,31,28,20,102,185,228,{"$f":"SUM(AB6:AB9)","v":-11}]

{"sheet":"64","index":4,"n_rows":14,"n_cols":28,"rows_kept":14,"cut":false,"hidden":false,"merged":[[2,7,2,19],[1,1,1,27],[2,26,2,27],[3,27,4,27],[17,1,17,12],[3,13,4,13],[3,25,4,25],[3,26,4,26],[3,1,4,1]]}
[]
[null,"ADHÉRENTS  NOUVELLE  AQUITAINE  2017 - 2018"]
[null,null,null,null,null,null,null,"PYRÉNNÉES  ATLANTIQUES (64)"]
[null,"CLUBS","S65","S50",null,"U20","U18","U16","U14","U12","U10","U8","Total","TF","S65","S50",null,"U20","U18","U16","U14","U12","U10","U8","Total","TM ","TOTAL","Var."]
[null,null,"VF","SF+","SF","JF","CF","MF","BF","PuF","PoF","PpF","JeunesF",null,"VM","SM+","SM","JM","CM","MM","BM","PuM","PoM","PpM","JeunesM"]
[null," Échiquier Bayonne Adour",{"$f":"'FEUILLE de SAISIE'!D120","v":5},{"$f":"'FEUILLE de SAISIE'!E120","v":2},{"$f":"'FEUILLE de SAISIE'!F120","v":0},{"$f":"'FEUILLE de SAISIE'!G120","v":0},{"$f":"'FEUILLE de SAISIE'!H120","v":0},{"$f":"'FEUILLE de SAISIE'!I120","v":0},{"$f":"'FEUILLE de SAISIE'!J120","v":0},{"$f":"'FEUILLE de SAISIE'!K120","v":0},{"$f":"'FEUILLE de SAISIE'!L120","v":0},{"$f":"'FEUILLE de SAISIE'!M120","v":0},{"$f":"SUM(F6:L6)","v":0},{"$f":"SUM(C6:L6)","v":7},{"$f":"'FEUILLE de SAISIE'!N120","v":5},{"$f":"'FEUILLE de SAISIE'!O120","v":6},{"$f":"'FEUILLE de SAISIE'!P120","v":2},{"$f":"'FEUILLE de SAISIE'!Q120","v":0},{"$f":"'FEUILLE de SAISIE'!R120","v":4},{"$f":"'FEUILLE de SAISIE'!S120","v":0},{"$f":"'FEUILLE de SAISIE'!T120","v":4},{"$f":"'FEUILLE de SAISIE'!U120","v":0},{"$f":"'FEUILLE de SAISIE'!V120","v":3},{"$f":"'FEUILLE de SAISIE'!W120","v":1},{"$f":"SUM(R6:X6)","v":12},{"$f":"SUM(O6:X6)","v":25},{"$f":"N6+Z6","v":32},{"$f":"AA6-21","v":11}]
[null," Aviron Bayonnais Échecs",{"$f":"'FEUILLE de SAISIE'!D127","v":1},{"$f":"'FEUILLE de SAISIE'!E127","v":2},{"$f":"'FEUILLE de SAISIE'!F127","v":2},{"$f":"'FEUILLE de SAISIE'!G127","v":0},{"$f":"'FEUILLE de SAISIE'!H127","v":0},{"$f":"'FEUILLE de SAISIE'!I127","v":0},{"$f":"'FEUILLE de SAISIE'!J127","v":1},{"$f":"'FEUILLE de SAISIE'!K127","v":2},{"$f":"'FEUILLE de SAISIE'!L127","v":4},{"$f":"'FEUILLE de SAISIE'!M127","v":7},{"$f":"SUM(F7:L7)","v":14},{"$f":"SUM(C7:L7)","v":19},{"$f":"'FEUILLE de SAISIE'!N127","v":4},{"$f":"'FEUILLE de SAISIE'!O127","v":12},{"$f":"'FEUILLE de SAISIE'!P127","v":19},{"$f":"'FEUILLE de SAISIE'!Q127","v":1},{"$f":"'FEUILLE de SAISIE'!R127","v":1},{"$f":"'FEUILLE de SAISIE'!S127","v":4},{"$f":"'FEUILLE de SAISIE'!T127","v":0},{"$f":"'FEUILLE de SAISIE'!U127","v":19},{"$f":"'FEUILLE de SAISIE'!V127","v":58},{"$f":"'FEUILLE de SAISIE'!W127","v":45},{"$f":"SUM(R7:X7)","v":128},{"$f":"SUM(O7:X7)","v":163},{"$f":"N7+Z7","v":182},{"$f":"AA7-135","v":47}]
[null," Échecs SICSBT",{"$f":"'FEUILLE de SAISIE'!D129","v":1},{"$f":"'FEUILLE de SAISIE'!E129","v":0},{"$f":"'FEUILLE de SAISIE'!F129","v":1},{"$f":"'FEUILLE de SAISIE'!G129","v":0},{"$f":"'FEUILLE de SAISIE'!H129","v":0},{"$f":"'FEUILLE de SAISIE'!I129","v":0},{"$f":"'FEUILLE de SAISIE'!J129","v":0},{"$f":"'FEUILLE de SAISIE'!K129","v":0},{"$f":"'FEUILLE de SAISIE'!L129","v":0},{"$f":"'FEUILLE de SAISIE'!M129","v":0},{"$f":"SUM(F8:L8)","v":0},{"$f":"SUM(C8:L8)","v":2},{"$f":"'FEUILLE de SAISIE'!N129","v":1},{"$f":"'FEUILLE de SAISIE'!O129","v":2},{"$f":"'FEUILLE de SAISIE'!P129","v":0},{"$f":"'FEUILLE de SAISIE'!Q129","v":0},{"$f":"'FEUILLE de SAISIE'!R129","v":0},{"$f":"'FEUILLE de SAISIE'!S129","v":0},{"$f":"'FEUILLE de SAISIE'!T129","v":2},{"$f":"'FEUILLE de SAISIE'!U129","v":4},{"$f":"'FEUILLE de SAISIE'!V129","v":6},{"$f":"'FEUILLE de SAISIE'!W129","v":1},{"$f":"SUM(R8:X8)","v":13},{"$f":"SUM(O8:X8)","v":16},{"$f":"N8+Z8","v":18},{"$f":"AA8-23","v":-5}]
[null," Échiquier Henri IV Pau",{"$f":"'FEUILLE de SAISIE'!D136","v":4},{"$f":"'FEUILLE de SAISIE'!E136","v":2},{"$f":"'FEUILLE de SAISIE'!F136","v":2},{"$f":"'FEUILLE de SAISIE'!G136","v":0},{"$f":"'FEUILLE de SAISIE'!H136","v":1},{"$f":"'FEUILLE de SAISIE'!I136","v":1},{"$f":"'FEUILLE de SAISIE'!J136","v":7},{"$f":"'FEUILLE de SAISIE'!K136","v":2},{"$f":"'FEUILLE de SAISIE'!L136","v":9},{"$f":"'FEUILLE de SAISIE'!M136","v":4},24,32,{"$f":"'FEUILLE de SAISIE'!N136","v":9},{"$f":"'FEUILLE de SAISIE'!O136","v":6},{"$f":"'FEUILLE de SAISIE'!P136","v":21},{"$f":"'FEUILLE de SAISIE'!Q136","v":0},{"$f":"'FEUILLE de SAISIE'!R136","v":8},{"$f":"'FEUILLE de SAISIE'!S136","v":11},{"$f":"'FEUILLE de SAISIE'!T136","v":16},{"$f":"'FEUILLE de SAISIE'!U136","v":24},{"$f":"'FEUILLE de SAISIE'!V136","v":22},{"$f":"'FEUILLE de SAISIE'!W136","v":22},103,139,171,{"$f":"AA9-251","v":-80}]
[null," Pau Sarrailh Échecs",{"$f":"'FEUILLE de SAISIE'!D138","v":0},{"$f":"'FEUILLE de SAISIE'!E138","v":0},{"$f":"'FEUILLE de SAISIE'!F138","v":0},{"$f":"'FEUILLE de SAISIE'!G138","v":0},{"$f":"'FEUILLE de SAISIE'!H138","v":0},{"$f":"'FEUILLE de SAISIE'!I138","v":0},{"$f":"'FEUILLE de SAISIE'!J138","v":0},{"$f":"'FEUILLE de SAISIE'!K138","v":0},{"$f":"'FEUILLE de SAISIE'!L138","v":0},{"$f":"'FEUILLE de SAISIE'!M138","v":0},0,0,{"$f":"'FEUILLE de SAISIE'!N138","v":5},{"$f":"'FEUILLE de SAISIE'!O138","v":1},{"$f":"'FEUILLE de SAISIE'!P138","v":4},{"$f":"'FEUILLE de SAISIE'!Q138","v":0},{"$f":"'FEUILLE de SAISIE'!R138","v":2},{"$f":"'FEUILLE de SAISIE'!S138","v":0},{"$f":"'FEUILLE de SAISIE'!T138","v":1},{"$f":"'FEUILLE de SAISIE'!U138","v":0},{"$f":"'FEUILLE de SAISIE'!V138","v":1},{"$f":"'FEUILLE de SAISIE'!W138","v":3},7,17,17,{"$f":"AA10-19","v":-2}]
[null," Club d'Échecs Pau Berlioz",{"$f":"'FEUILLE de SAISIE'!D140","v":3},{"$f":"'FEUILLE de SAISIE'!E140","v":1},{"$f":"'FEUILLE de SAISIE'!F140","v":4},{"$f":"'FEUILLE de SAISIE'!G140","v":0},{"$f":"'FEUILLE de SAISIE'!H140","v":0},{"$f":"'FEUILLE de SAISIE'!I140","v":0},{"$f":"'FEUILLE de SAISIE'!J140","v":0},{"$f":"'FEUILLE de SAISIE'!K140","v":0},{"$f":"'FEUILLE de SAISIE'!L140","v":0},{"$f":"'FEUILLE de SAISIE'!M140","v":2},2,10,{"$f":"'FEUILLE de SAISIE'!N140","v":8},{"$f":"'FEUILLE de SAISIE'!O140","v":3},{"$f":"'FEUILLE de SAISIE'!P140","v":3},{"$f":"'FEUILLE de SAISIE'!Q140","v":1},{"$f":"'FEUILLE de SAISIE'!R140","v":0},{"$f":"'FEUILLE de SAISIE'!S140","v":2},{"$f":"'FEUILLE de SAISIE'!T140","v":3},{"$f":"'FEUILLE de SAISIE'!U140","v":4},{"$f":"'FEUILLE de SAISIE'!V140","v":4},{"$f":"'FEUILLE de SAISIE'!W140","v":1},15,29,39,{"$f":"AA11-45","v":-6}]
[null," École d'Échecs du Béarn",{"$f":"'FEUILLE de SAISIE'!D142","v":0},{"$f":"'FEUILLE de SAISIE'!E142","v":0},{"$f":"'FEUILLE de SAISIE'!F142","v":1},{"$f":"'FEUILLE de SAISIE'!G142","v":0},{"$f":"'FEUILLE de SAISIE'!H142","v":0},{"$f":"'FEUILLE de SAISIE'!I142","v":0},{"$f":"'FEUILLE de SAISIE'!J142","v":0},{"$f":"'FEUILLE de SAISIE'!K142","v":0},{"$f":"'FEUILLE de SAISIE'!L142","v":3},{"$f":"'FEUILLE de SAISIE'!M142","v":3},6,7,{"$f":"'FEUILLE de SAISIE'!N142","v":0},{"$f":"'FEUILLE de SAISIE'!O142","v":0},{"$f":"'FEUILLE de SAISIE'!P142","v":2},{"$f":"'FEUILLE de SAISIE'!Q142","v":0},{"$f":"'FEUILLE de SAISIE'!R142","v":0},{"$f":"'FEUILLE de SAISIE'!S142","v":0},{"$f":"'FEUILLE de SAISIE'!T142","v":1},{"$f":"'FEUILLE de SAISIE'!U142","v":0},{"$f":"'FEUILLE de SAISIE'!V142","v":3},{"$f":"'FEUILLE de SAISIE'!W142","v":4},8,10,17,{"$f":"AA12-40","v":-23}]
[null," La Tour du Château",{"$f":"'FEUILLE de SAISIE'!D144","v":2},{"$f":"'FEUILLE de SAISIE'!E144","v":0},{"$f":"'FEUILLE de SAISIE'!F144","v":2},{"$f":"'FEUILLE de SAISIE'!G144","v":0},{"$f":"'FEUILLE de SAISIE'!H144","v":0},{"$f":"'FEUILLE de SAISIE'!I144","v":0},{"$f":"'FEUILLE de SAISIE'!J144","v":0},{"$f":"'FEUILLE de SAISIE'!K144","v":0},{"$f":"'FEUILLE de SAISIE'!L144","v":0},{"$f":"'FEUILLE de SAISIE'!M144","v":0},0,4,{"$f":"'FEUILLE de SAISIE'!N144","v":2},{"$f":"'FEUILLE de SAISIE'!O144","v":1},{"$f":"'FEUILLE de SAISIE'!P144","v":1},{"$f":"'FEUILLE de SAISIE'!Q144","v":0},{"$f":"'FEUILLE de SAISIE'!R144","v":0},{"$f":"'FEUILLE de SAISIE'!S144","v":1},{"$f":"'FEUILLE de SAISIE'!T144","v":1},{"$f":"'FEUILLE de SAISIE'!U144","v":2},{"$f":"'FEUILLE de SAISIE'!V144","v":3},{"$f":"'FEUILLE de SAISIE'!W144","v":1},8,12,16,{"$f":"AA13-23","v":-7}]
[null," TOTAUX CDJE 64",{"$f":"SUM(C6:C13)","v":16},{"$f":"SUM(D6:D13)","v":7},12,0,1,1,8,4,16,16,46,81,34,31,52,2,15,18,28,53,100,78,294,411,492,-65]

{"sheet":"TOTAUX AQ","index":5,"n_rows":13,"n_cols":29,"rows_kept":13,"cut":false,"hidden":false,"merged":[[3,28,4,28],[1,1,2,28],[14,1,14,4],[3,1,4,1],[3,13,4,13],[3,26,4,26],[3,25,4,25],[3,27,4,27],[12,19,12,22],[12,1,12,15]]}
[]
[null,"ADHÉRENTS  en  AQUITAINE  2017 - 2018"]
[]
[null,"CDJE","S65","S50",null,"U20","U18","U16","U14","U12","U10","U8","Total","TF","S65","S50",null,"U20","U18","U16","U14","U12","U10","U8","Total","TM ","TOTAL","Écarts","Nb de clubs"]
[null,null,"VF","SF+","SF","JF","CF","MF","BF","PuF","PoF","PpF","Jeunes F",null,"VM","SM+","SM","JM","CM","MM","BM","PuM","PoM","PpM","Jeunes M"]
[null,"  CDJE 24",{"$f":"'24'!C11","v":1},{"$f":"'24'!D11","v":5},{"$f":"'24'!E11","v":2},{"$f":"'24'!F11","v":0},{"$f":"'24'!G11","v":0},{"$f":"'24'!H11","v":1},{"$f":"'24'!I11","v":3},{"$f":"'24'!J11","v":4},{"$f":"'24'!K11","v":2},{"$f":"'24'!L11","v":3},{"$f":"SUM(F6:L6)","v":13},{"$f":"SUM(C6:L6)","v":21},{"$f":"'24'!O11","v":19},{"$f":"'24'!P11","v":19},{"$f":"'24'!Q11","v":22},{"$f":"'24'!R11","v":0},{"$f":"'24'!S11","v":3},{"$f":"'24'!T11","v":9},{"$f":"'24'!U11","v":6},{"$f":"'24'!V11","v":11},{"$f":"'24'!W11","v":6},{"$f":"'24'!X11","v":2},{"$f":"SUM(R6:X6)","v":37},{"$f":"SUM(O6:X6)","v":97},{"$f":"N6+Z6","v":118},{"$f":"AA6-174","v":-56},5]
[null,"  CDJE 33",{"$f":"'33'!C19","v":9},{"$f":"'33'!D19","v":16},{"$f":"'33'!E19","v":22},{"$f":"'33'!F19","v":5},{"$f":"'33'!G19","v":5},{"$f":"'33'!H19","v":12},{"$f":"'33'!I19","v":35},{"$f":"'33'!J19","v":62},{"$f":"'33'!K19","v":76},{"$f":"'33'!L19","v":59},{"$f":"SUM(F7:L7)","v":254},{"$f":"SUM(C7:L7)","v":301},{"$f":"'33'!O19","v":74},{"$f":"'33'!P19","v":108},{"$f":"'33'!Q19","v":172},{"$f":"'33'!R19","v":13},{"$f":"'33'!S19","v":36},{"$f":"'33'!T19","v":60},{"$f":"'33'!U19","v":99},{"$f":"'33'!V19","v":194},{"$f":"'33'!W19","v":255},{"$f":"'33'!X19","v":141},{"$f":"SUM(R7:X7)","v":798},{"$f":"SUM(O7:X7)","v":1152},{"$f":"N7+Z7","v":1453},{"$f":"AA7-1428","v":25},13]
[null,"  CDJE 40",{"$f":"'40'!C10","v":2},{"$f":"'40'!D10","v":5},{"$f":"'40'!E10","v":5},{"$f":"'40'!F10","v":0},{"$f":"'40'!G10","v":2},{"$f":"'40'!H10","v":0},{"$f":"'40'!I10","v":15},{"$f":"'40'!J10","v":18},{"$f":"'40'!K10","v":12},{"$f":"'40'!L10","v":1},48,60,{"$f":"'40'!O10","v":31},{"$f":"'40'!P10","v":28},{"$f":"'40'!Q10","v":21},{"$f":"'40'!R10","v":1},{"$f":"'40'!S10","v":2},{"$f":"'40'!T10","v":14},{"$f":"'40'!U10","v":40},{"$f":"'40'!V10","v":58},{"$f":"'40'!W10","v":30},{"$f":"'40'!X10","v":4},149,229,289,{"$f":"AA8-317","v":-28},4]
[null,"  CDJE 47",{"$f":"'47'!C10","v":3},{"$f":"'47'!D10","v":7},{"$f":"'47'!E10","v":11},{"$f":"'47'!F10","v":0},{"$f":"'47'!G10","v":0},{"$f":"'47'!H10","v":0},{"$f":"'47'!I10","v":3},{"$f":"'47'!J10","v":5},{"$f":"'47'!K10","v":8},{"$f":"'47'!L10","v":6},22,43,{"$f":"'47'!O10","v":15},{"$f":"'47'!P10","v":26},{"$f":"'47'!Q10","v":42},{"$f":"'47'!R10","v":0},{"$f":"'47'!S10","v":3},{"$f":"'47'!T10","v":9},{"$f":"'47'!U10","v":11},{"$f":"'47'!V10","v":31},{"$f":"'47'!W10","v":28},{"$f":"'47'!X10","v":20},102,185,228,{"$f":"AA9-215","v":13},4]
[null,"  CDJE 64",{"$f":"'64'!C14","v":16},{"$f":"'64'!D14","v":7},{"$f":"'64'!E14","v":12},{"$f":"'64'!F14","v":0},{"$f":"'64'!G14","v":1},{"$f":"'64'!H14","v":1},{"$f":"'64'!I14","v":8},{"$f":"'64'!J14","v":4},{"$f":"'64'!K14","v":16},{"$f":"'64'!L14","v":16},46,81,{"$f":"'64'!O14","v":34},{"$f":"'64'!P14","v":31},{"$f":"'64'!Q14","v":52},{"$f":"'64'!R14","v":2},{"$f":"'64'!S14","v":15},{"$f":"'64'!T14","v":18},{"$f":"'64'!U14","v":28},{"$f":"'64'!V14","v":53},{"$f":"'64'!W14","v":100},{"$f":"'64'!X14","v":78},294,411,492,{"$f":"AA10-557","v":-65},8]
[null," TOTAUX AQUITAINE",{"$f":"SUM(C6:C10)","v":31},{"$f":"SUM(D6:D10)","v":40},52,5,8,14,64,93,114,85,383,506,173,212,309,16,59,110,184,347,419,245,1380,2074,2580,-111,{"$f":"SUM(AC6:AC10)","v":34}]
[]
[null,"(T= total; V= vétéran; S= sénior; J= junior; C= cadet; M= minime; B= benjamin; Po= poussin; Pp= petit poussin; F= féminin; M= masculin )",null,null,null,null,null,null,null,null,null,null,null,null,null,null,null,null,null,"Au 31 août 2018"]

{"sheet":"16","index":6,"n_rows":13,"n_cols":28,"rows_kept":13,"cut":false,"hidden":false,"merged":[[2,1,2,27],[3,26,3,27],[4,27,5,27],[4,1,5,1],[4,13,5,13],[4,25,5,25],[4,26,5,26],[3,7,3,16]]}
[]
[]
[null,"ADHÉRENTS  NOUVELLE  AQUITAINE  2017 - 2018"]
[null,null,null,null,null,null,null,"CHARENTE (16)"]
[null,"CLUBS","S65","S50",null,"U20","U18","U16","U14","U12","U10","U8","Total","TF","S65","S50",null,"U20","U18","U16","U14","U12","U10","U8","Total","TM ","TOTAL","Var."]
[null,null,"VF","SF+","SF","JF","CF","MF","BF","PuF","PoF","PpF","JeunesF",null,"VM","SM+","SM","JM","CM","MM","BM","PuM","PoM","PpM","JeunesM"]
[null," Échiquier Angoumoisin",{"$f":"'FEUILLE de SAISIE'!D148","v":1},{"$f":"'FEUILLE de SAISIE'!E148","v":0},{"$f":"'FEUILLE de SAISIE'!F148","v":0},{"$f":"'FEUILLE de SAISIE'!G148","v":0},{"$f":"'FEUILLE de SAISIE'!H148","v":0},{"$f":"'FEUILLE de SAISIE'!I148","v":0},{"$f":"'FEUILLE de SAISIE'!J148","v":0},{"$f":"'FEUILLE de SAISIE'!K148","v":1},{"$f":"'FEUILLE de SAISIE'!L148","v":1},{"$f":"'FEUILLE de SAISIE'!M148","v":1},{"$f":"SUM(F7:L7)","v":3},{"$f":"SUM(C7:L7)","v":4},{"$f":"'FEUILLE de SAISIE'!N148","v":0},{"$f":"'FEUILLE de SAISIE'!O148","v":5},{"$f":"'FEUILLE de SAISIE'!P148","v":12},{"$f":"'FEUILLE de SAISIE'!Q148","v":0},{"$f":"'FEUILLE de SAISIE'!R148","v":0},{"$f":"'FEUILLE de SAISIE'!S148","v":0},{"$f":"'FEUILLE de SAISIE'!T148","v":0},{"$f":"'FEUILLE de SAISIE'!U148","v":2},{"$f":"'FEUILLE de SAISIE'!V148","v":5},{"$f":"'FEUILLE de SAISIE'!W148","v":5},{"$f":"SUM(R7:X7)","v":12},{"$f":"SUM(O7:X7)","v":29},{"$f":"N7+Z7","v":33},{"$f":"AA7-24","v":9}]
[null," Section échecs amicale laïque Barbezilienne",{"$f":"'FEUILLE de SAISIE'!D150","v":0},{"$f":"'FEUILLE de SAISIE'!E150","v":0},{"$f":"'FEUILLE de SAISIE'!F150","v":0},{"$f":"'FEUILLE de SAISIE'!G150","v":0},{"$f":"'FEUILLE de SAISIE'!H150","v":0},{"$f":"'FEUILLE de SAISIE'!I150","v":0},{"$f":"'FEUILLE de SAISIE'!J150","v":0},{"$f":"'FEUILLE de SAISIE'!K150","v":0},{"$f":"'FEUILLE de SAISIE'!L150","v":1},{"$f":"'FEUILLE de SAISIE'!M150","v":1},{"$f":"SUM(F8:L8)","v":2},{"$f":"SUM(C8:L8)","v":2},{"$f":"'FEUILLE de SAISIE'!N150","v":0},{"$f":"'FEUILLE de SAISIE'!O150","v":1},{"$f":"'FEUILLE de SAISIE'!P150","v":0},{"$f":"'FEUILLE de SAISIE'!Q150","v":0},{"$f":"'FEUILLE de SAISIE'!R150","v":0},{"$f":"'FEUILLE de SAISIE'!S150","v":0},{"$f":"'FEUILLE de SAISIE'!T150","v":0},{"$f":"'FEUILLE de SAISIE'!U150","v":7},{"$f":"'FEUILLE de SAISIE'!V150","v":10},{"$f":"'FEUILLE de SAISIE'!W150","v":0},{"$f":"SUM(R8:X8)","v":17},{"$f":"SUM(O8:X8)","v":18},{"$f":"N8+Z8","v":20},{"$f":"AA8-33","v":-13}]
[null," Chasseneuil Animation Loisirs et Culture-CALC",{"$f":"'FEUILLE de SAISIE'!D152","v":2},{"$f":"'FEUILLE de SAISIE'!E152","v":1},{"$f":"'FEUILLE de SAISIE'!F152","v":0},{"$f":"'FEUILLE de SAISIE'!G152","v":0},{"$f":"'FEUILLE de SAISIE'!H152","v":0},{"$f":"'FEUILLE de SAISIE'!I152","v":0},{"$f":"'FEUILLE de SAISIE'!J152","v":0},{"$f":"'FEUILLE de SAISIE'!K152","v":0},{"$f":"'FEUILLE de SAISIE'!L152","v":3},{"$f":"'FEUILLE de SAISIE'!M152","v":0},3,6,{"$f":"'FEUILLE de SAISIE'!N152","v":2},{"$f":"'FEUILLE de SAISIE'!O152","v":0},{"$f":"'FEUILLE de SAISIE'!P152","v":2},{"$f":"'FEUILLE de SAISIE'!Q152","v":0},{"$f":"'FEUILLE de SAISIE'!R152","v":0},{"$f":"'FEUILLE de SAISIE'!S152","v":0},{"$f":"'FEUILLE de SAISIE'!T152","v":2},{"$f":"'FEUILLE de SAISIE'!U152","v":7},{"$f":"'FEUILLE de SAISIE'!V152","v":13},{"$f":"'FEUILLE de SAISIE'!W152","v":0},22,26,32,{"$f":"AA9-31","v":1}]
[null," Club d'Échecs de Cognac",{"$f":"'FEUILLE de SAISIE'!D154","v":0},{"$f":"'FEUILLE de SAISIE'!E154","v":0},{"$f":"'FEUILLE de SAISIE'!F154","v":0},{"$f":"'FEUILLE de SAISIE'!G154","v":0},{"$f":"'FEUILLE de SAISIE'!H154","v":0},{"$f":"'FEUILLE de SAISIE'!I154","v":0},{"$f":"'FEUILLE de SAISIE'!J154","v":0},{"$f":"'FEUILLE de SAISIE'!K154","v":0},{"$f":"'FEUILLE de SAISIE'!L154","v":0},{"$f":"'FEUILLE de SAISIE'!M154","v":0},0,0,{"$f":"'FEUILLE de SAISIE'!N154","v":6},{"$f":"'FEUILLE de SAISIE'!O154","v":7},{"$f":"'FEUILLE de SAISIE'!P154","v":4},{"$f":"'FEUILLE de SAISIE'!Q154","v":1},{"$f":"'FEUILLE de SAISIE'!R154","v":3},{"$f":"'FEUILLE de SAISIE'!S154","v":0},{"$f":"'FEUILLE de SAISIE'!T154","v":2},{"$f":"'FEUILLE de SAISIE'!U154","v":3},{"$f":"'FEUILLE de SAISIE'!V154","v":5},{"$f":"'FEUILLE de SAISIE'!W154","v":1},15,32,32,{"$f":"AA10-25","v":7}]
[null," Échiquier Couronnais",{"$f":"'FEUILLE de SAISIE'!D158","v":0},{"$f":"'FEUILLE de SAISIE'!E158","v":0},{"$f":"'FEUILLE de SAISIE'!F158","v":2},{"$f":"'FEUILLE de SAISIE'!G158","v":0},{"$f":"'FEUILLE de SAISIE'!H158","v":0},{"$f":"'FEUILLE de SAISIE'!I158","v":0},{"$f":"'FEUILLE de SAISIE'!J158","v":1},{"$f":"'FEUILLE de SAISIE'!K158","v":1},{"$f":"'FEUILLE de SAISIE'!L158","v":5},{"$f":"'FEUILLE de SAISIE'!M158","v":0},7,9,{"$f":"'FEUILLE de SAISIE'!N158","v":3},{"$f":"'FEUILLE de SAISIE'!O158","v":10},{"$f":"'FEUILLE de SAISIE'!P158","v":15},{"$f":"'FEUILLE de SAISIE'!Q158","v":0},{"$f":"'FEUILLE de SAISIE'!R158","v":1},{"$f":"'FEUILLE de SAISIE'!S158","v":4},{"$f":"'FEUILLE de SAISIE'!T158","v":1},{"$f":"'FEUILLE de SAISIE'!U158","v":14},{"$f":"'FEUILLE de SAISIE'!V158","v":5},{"$f":"'FEUILLE de SAISIE'!W158","v":1},26,54,63,{"$f":"AA11-47","v":16}]
[null," Les Tours Du Montbronnais",{"$f":"'FEUILLE de SAISIE'!D162","v":0},{"$f":"'FEUILLE de SAISIE'!E162","v":0},{"$f":"'FEUILLE de SAISIE'!F162","v":0},{"$f":"'FEUILLE de SAISIE'!G162","v":0},{"$f":"'FEUILLE de SAISIE'!H162","v":0},{"$f":"'FEUILLE de SAISIE'!I162","v":3},{"$f":"'FEUILLE de SAISIE'!J162","v":1},{"$f":"'FEUILLE de SAISIE'!K162","v":1},{"$f":"'FEUILLE de SAISIE'!L162","v":2},{"$f":"'FEUILLE de SAISIE'!M162","v":2},9,9,{"$f":"'FEUILLE de SAISIE'!N162","v":5},{"$f":"'FEUILLE de SAISIE'!O162","v":4},{"$f":"'FEUILLE de SAISIE'!P162","v":5},{"$f":"'FEUILLE de SAISIE'!Q162","v":0},{"$f":"'FEUILLE de SAISIE'!R162","v":0},{"$f":"'FEUILLE de SAISIE'!S162","v":0},{"$f":"'FEUILLE de SAISIE'!T162","v":2},{"$f":"'FEUILLE de SAISIE'!U162","v":5},{"$f":"'FEUILLE de SAISIE'!V162","v":12},{"$f":"'FEUILLE de SAISIE'!W162","v":0},19,33,42,{"$f":"AA12-41","v":1}]
[null," TOTAUX CDJE 16",{"$f":"SUM(C7:C12)","v":3},1,2,0,0,3,2,3,12,4,24,30,16,27,38,1,4,4,7,38,50,7,111,192,222,{"$f":"SUM(AB7:AB12)","v":21}]

{"sheet":"17","index":7,"n_rows":12,"n_cols":28,"rows_kept":12,"cut":false,"hidden":false,"merged":[[2,1,2,27],[3,26,3,27],[4,27,5,27],[3,7,3,19],[4,1,5,1],[4,13,5,13],[4,25,5,25],[4,26,5,26]]}
[]
[]
[null,"ADHÉRENTS  NOUVELLE  AQUITAINE  2017 - 2018"]
[null,null,null,null,null,null,null,"CHARENTE  MARITIME (17)"]
[null,"CLUBS","S65","S50",null,"U20","U18","U16","U14","U12","U10","U8","Total","TF","S65","S50",null,"U20","U18","U16","U14","U12","U10","U8","Total","TM ","TOTAL","Var."]
[null,null,"VF","SF+","SF","JF","CF","MF","BF","PuF","PoF","PpF","JeunesF",null,"VM","SM+","SM","JM","CM","MM","BM","PuM","PoM","PpM","JeunesM"]
[null," Aytré-La Rochelle Échecs",{"$f":"'FEUILLE de SAISIE'!D165","v":0},{"$f":"'FEUILLE de SAISIE'!E165","v":0},{"$f":"'FEUILLE de SAISIE'!F165","v":1},{"$f":"'FEUILLE de SAISIE'!G165","v":0},{"$f":"'FEUILLE de SAISIE'!H165","v":0},{"$f":"'FEUILLE de SAISIE'!I165","v":0},{"$f":"'FEUILLE de SAISIE'!J165","v":0},{"$f":"'FEUILLE de SAISIE'!K165","v":0},{"$f":"'FEUILLE de SAISIE'!L165","v":0},{"$f":"'FEUILLE de SAISIE'!M165","v":0},{"$f":"SUM(F7:L7)","v":0},{"$f":"SUM(C7:L7)","v":1},{"$f":"'FEUILLE de SAISIE'!N165","v":3},{"$f":"'FEUILLE de SAISIE'!O165","v":14},{"$f":"'FEUILLE de SAISIE'!P165","v":7},{"$f":"'FEUILLE de SAISIE'!Q165","v":0},{"$f":"'FEUILLE de SAISIE'!R165","v":1},{"$f":"'FEUILLE de SAISIE'!S165","v":0},{"$f":"'FEUILLE de SAISIE'!T165","v":2},{"$f":"'FEUILLE de SAISIE'!U165","v":0},{"$f":"'FEUILLE de SAISIE'!V165","v":1},{"$f":"'FEUILLE de SAISIE'!W165","v":0},{"$f":"SUM(R7:X7)","v":4},{"$f":"SUM(O7:X7)","v":28},{"$f":"N7+Z7","v":29},{"$f":"AA7-27","v":2}]
[null," Club d'Échecs de Marennes-Oléron",{"$f":"'FEUILLE de SAISIE'!D167","v":0},{"$f":"'FEUILLE de SAISIE'!E167","v":1},{"$f":"'FEUILLE de SAISIE'!F167","v":1},{"$f":"'FEUILLE de SAISIE'!G167","v":0},{"$f":"'FEUILLE de SAISIE'!H167","v":0},{"$f":"'FEUILLE de SAISIE'!I167","v":0},{"$f":"'FEUILLE de SAISIE'!J167","v":0},{"$f":"'FEUILLE de SAISIE'!K167","v":0},{"$f":"'FEUILLE de SAISIE'!L167","v":0},{"$f":"'FEUILLE de SAISIE'!M167","v":0},{"$f":"SUM(F8:L8)","v":0},{"$f":"SUM(C8:L8)","v":2},{"$f":"'FEUILLE de SAISIE'!N167","v":2},{"$f":"'FEUILLE de SAISIE'!O167","v":7},{"$f":"'FEUILLE de SAISIE'!P167","v":4},{"$f":"'FEUILLE de SAISIE'!Q167","v":0},{"$f":"'FEUILLE de SAISIE'!R167","v":1},{"$f":"'FEUILLE de SAISIE'!S167","v":2},{"$f":"'FEUILLE de SAISIE'!T167","v":0},{"$f":"'FEUILLE de SAISIE'!U167","v":2},{"$f":"'FEUILLE de SAISIE'!V167","v":7},{"$f":"'FEUILLE de SAISIE'!W167","v":4},{"$f":"SUM(R8:X8)","v":16},{"$f":"SUM(O8:X8)","v":29},{"$f":"N8+Z8","v":31},{"$f":"AA8-26","v":5}]
[null," Échiquier Rochefortais",{"$f":"'FEUILLE de SAISIE'!D169","v":0},{"$f":"'FEUILLE de SAISIE'!E169","v":0},{"$f":"'FEUILLE de SAISIE'!F169","v":0},{"$f":"'FEUILLE de SAISIE'!G169","v":0},{"$f":"'FEUILLE de SAISIE'!H169","v":0},{"$f":"'FEUILLE de SAISIE'!I169","v":0},{"$f":"'FEUILLE de SAISIE'!J169","v":2},{"$f":"'FEUILLE de SAISIE'!K169","v":0},{"$f":"'FEUILLE de SAISIE'!L169","v":2},{"$f":"'FEUILLE de SAISIE'!M169","v":0},4,4,{"$f":"'FEUILLE de SAISIE'!N169","v":2},{"$f":"'FEUILLE de SAISIE'!O169","v":8},{"$f":"'FEUILLE de SAISIE'!P169","v":5},{"$f":"'FEUILLE de SAISIE'!Q169","v":0},{"$f":"'FEUILLE de SAISIE'!R169","v":1},{"$f":"'FEUILLE de SAISIE'!S169","v":2},{"$f":"'FEUILLE de SAISIE'!T169","v":3},{"$f":"'FEUILLE de SAISIE'!U169","v":3},{"$f":"'FEUILLE de SAISIE'!V169","v":3},{"$f":"'FEUILLE de SAISIE'!W169","v":2},14,29,33,{"$f":"AA9-32","v":1}]
[null," La Tour de Germanicus",{"$f":"'FEUILLE de SAISIE'!D175","v":0},{"$f":"'FEUILLE de SAISIE'!E175","v":2},{"$f":"'FEUILLE de SAISIE'!F175","v":2},{"$f":"'FEUILLE de SAISIE'!G175","v":0},{"$f":"'FEUILLE de SAISIE'!H175","v":0},{"$f":"'FEUILLE de SAISIE'!I175","v":1},{"$f":"'FEUILLE de SAISIE'!J175","v":2},{"$f":"'FEUILLE de SAISIE'!K175","v":12},{"$f":"'FEUILLE de SAISIE'!L175","v":8},{"$f":"'FEUILLE de SAISIE'!M175","v":1},24,28,{"$f":"'FEUILLE de SAISIE'!N175","v":6},{"$f":"'FEUILLE de SAISIE'!O175","v":11},{"$f":"'FEUILLE de SAISIE'!P175","v":4},{"$f":"'FEUILLE de SAISIE'!Q175","v":1},{"$f":"'FEUILLE de SAISIE'!R175","v":2},{"$f":"'FEUILLE de SAISIE'!S175","v":4},{"$f":"'FEUILLE de SAISIE'!T175","v":9},{"$f":"'FEUILLE de SAISIE'!U175","v":25},{"$f":"'FEUILLE de SAISIE'!V175","v":29},{"$f":"'FEUILLE de SAISIE'!W175","v":2},72,93,121,{"$f":"AA10-88","v":33}]
[null," Échiquier Surgerien",{"$f":"'FEUILLE de SAISIE'!D180","v":1},{"$f":"'FEUILLE de SAISIE'!E180","v":1},{"$f":"'FEUILLE de SAISIE'!F180","v":3},{"$f":"'FEUILLE de SAISIE'!G180","v":0},{"$f":"'FEUILLE de SAISIE'!H180","v":1},{"$f":"'FEUILLE de SAISIE'!I180","v":1},{"$f":"'FEUILLE de SAISIE'!J180","v":1},{"$f":"'FEUILLE de SAISIE'!K180","v":2},{"$f":"'FEUILLE de SAISIE'!L180","v":10},{"$f":"'FEUILLE de SAISIE'!M180","v":9},24,29,{"$f":"'FEUILLE de SAISIE'!N180","v":4},{"$f":"'FEUILLE de SAISIE'!O180","v":3},{"$f":"'FEUILLE de SAISIE'!P180","v":9},{"$f":"'FEUILLE de SAISIE'!Q180","v":0},{"$f":"'FEUILLE de SAISIE'!R180","v":5},{"$f":"'FEUILLE de SAISIE'!S180","v":4},{"$f":"'FEUILLE de SAISIE'!T180","v":8},{"$f":"'FEUILLE de SAISIE'!U180","v":19},{"$f":"'FEUILLE de SAISIE'!V180","v":18},{"$f":"'FEUILLE de SAISIE'!W180","v":17},71,87,116,{"$f":"AA11-112","v":4}]
[null," TOTAUX CDJE 17",{"$f":"SUM(C7:C11)","v":1},4,7,0,1,2,5,14,20,10,52,64,17,43,29,1,10,12,22,49,58,25,177,266,330,{"$f":"SUM(AB7:AB11)","v":45}]

{"sheet":"79","index":8,"n_rows":11,"n_cols":28,"rows_kept":11,"cut":false,"hidden":false,"merged":[[2,1,2,27],[3,26,3,27],[4,27,5,27],[3,7,3,19],[4,1,5,1],[4,13,5,13],[4,25,5,25],[4,26,5,26]]}
[]
[]
[null,"ADHÉRENTS  NOUVELLE  AQUITAINE  2017 - 2018"]
[null,null,null,null,null,null,null,"DEUX  SÈVRES (79)"]
[null,"CLUBS","S65","S50",null,"U20","U18","U16","U14","U12","U10","U8","Total","TF","S65","S50",null,"U20","U18","U16","U14","U12","U10","U8","Total","TM ","TOTAL","Var."]
[null,null,"VF","SF+","SF","JF","CF","MF","BF","PuF","PoF","PpF","JeunesF",null,"VM","SM+","SM","JM","CM","MM","BM","PuM","PoM","PpM","JeunesM"]
[null," Échec et Mat de Bressuire",{"$f":"'FEUILLE de SAISIE'!D183","v":1},{"$f":"'FEUILLE de SAISIE'!E183","v":0},{"$f":"'FEUILLE de SAISIE'!F183","v":2},{"$f":"'FEUILLE de SAISIE'!G183","v":0},{"$f":"'FEUILLE de SAISIE'!H183","v":0},{"$f":"'FEUILLE de SAISIE'!I183","v":0},{"$f":"'FEUILLE de SAISIE'!J183","v":0},{"$f":"'FEUILLE de SAISIE'!K183","v":1},{"$f":"'FEUILLE de SAISIE'!L183","v":2},{"$f":"'FEUILLE de SAISIE'!M183","v":1},{"$f":"SUM(F7:L7)","v":4},{"$f":"SUM(C7:L7)","v":7},{"$f":"'FEUILLE de SAISIE'!N183","v":0},{"$f":"'FEUILLE de SAISIE'!O183","v":3},{"$f":"'FEUILLE de SAISIE'!P183","v":5},{"$f":"'FEUILLE de SAISIE'!Q183","v":0},{"$f":"'FEUILLE de SAISIE'!R183","v":0},{"$f":"'FEUILLE de SAISIE'!S183","v":1},{"$f":"'FEUILLE de SAISIE'!T183","v":0},{"$f":"'FEUILLE de SAISIE'!U183","v":5},{"$f":"'FEUILLE de SAISIE'!V183","v":7},{"$f":"'FEUILLE de SAISIE'!W183","v":3},{"$f":"SUM(R7:X7)","v":16},{"$f":"SUM(O7:X7)","v":24},{"$f":"N7+Z7","v":31},{"$f":"AA7-31","v":0}]
[null," Échiquier Niortais",{"$f":"'FEUILLE de SAISIE'!D188","v":0},{"$f":"'FEUILLE de SAISIE'!E188","v":2},{"$f":"'FEUILLE de SAISIE'!F188","v":2},{"$f":"'FEUILLE de SAISIE'!G188","v":0},{"$f":"'FEUILLE de SAISIE'!H188","v":0},{"$f":"'FEUILLE de SAISIE'!I188","v":2},{"$f":"'FEUILLE de SAISIE'!J188","v":1},{"$f":"'FEUILLE de SAISIE'!K188","v":4},{"$f":"'FEUILLE de SAISIE'!L188","v":3},{"$f":"'FEUILLE de SAISIE'!M188","v":0},{"$f":"SUM(F8:L8)","v":10},{"$f":"SUM(C8:L8)","v":14},{"$f":"'FEUILLE de SAISIE'!N188","v":3},{"$f":"'FEUILLE de SAISIE'!O188","v":10},{"$f":"'FEUILLE de SAISIE'!P188","v":7},{"$f":"'FEUILLE de SAISIE'!Q188","v":1},{"$f":"'FEUILLE de SAISIE'!R188","v":2},{"$f":"'FEUILLE de SAISIE'!S188","v":4},{"$f":"'FEUILLE de SAISIE'!T188","v":9},{"$f":"'FEUILLE de SAISIE'!U188","v":10},{"$f":"'FEUILLE de SAISIE'!V188","v":16},{"$f":"'FEUILLE de SAISIE'!W188","v":10},{"$f":"SUM(R8:X8)","v":52},{"$f":"SUM(O8:X8)","v":72},{"$f":"N8+Z8","v":86},{"$f":"AA8-83","v":3}]
[null," Échiquier Saint Maixentais",{"$f":"'FEUILLE de SAISIE'!D190","v":0},{"$f":"'FEUILLE de SAISIE'!E190","v":0},{"$f":"'FEUILLE de SAISIE'!F190","v":0},{"$f":"'FEUILLE de SAISIE'!G190","v":0},{"$f":"'FEUILLE de SAISIE'!H190","v":0},{"$f":"'FEUILLE de SAISIE'!I190","v":0},{"$f":"'FEUILLE de SAISIE'!J190","v":0},{"$f":"'FEUILLE de SAISIE'!K190","v":0},{"$f":"'FEUILLE de SAISIE'!L190","v":0},{"$f":"'FEUILLE de SAISIE'!M190","v":0},0,0,{"$f":"'FEUILLE de SAISIE'!N190","v":2},{"$f":"'FEUILLE de SAISIE'!O190","v":3},{"$f":"'FEUILLE de SAISIE'!P190","v":9},{"$f":"'FEUILLE de SAISIE'!Q190","v":1},{"$f":"'FEUILLE de SAISIE'!R190","v":2},{"$f":"'FEUILLE de SAISIE'!S190","v":0},{"$f":"'FEUILLE de SAISIE'!T190","v":1},{"$f":"'FEUILLE de SAISIE'!U190","v":3},{"$f":"'FEUILLE de SAISIE'!V190","v":0},{"$f":"'FEUILLE de SAISIE'!W190","v":2},9,23,23,{"$f":"AA9-23","v":0}]
[null," Club d'Échecs de Thouars",{"$f":"'FEUILLE de SAISIE'!D192","v":0},{"$f":"'FEUILLE de SAISIE'!E192","v":0},{"$f":"'FEUILLE de SAISIE'!F192","v":1},{"$f":"'FEUILLE de SAISIE'!G192","v":0},{"$f":"'FEUILLE de SAISIE'!H192","v":0},{"$f":"'FEUILLE de SAISIE'!I192","v":1},{"$f":"'FEUILLE de SAISIE'!J192","v":0},{"$f":"'FEUILLE de SAISIE'!K192","v":0},{"$f":"'FEUILLE de SAISIE'!L192","v":1},{"$f":"'FEUILLE de SAISIE'!M192","v":0},2,3,{"$f":"'FEUILLE de SAISIE'!N192","v":2},{"$f":"'FEUILLE de SAISIE'!O192","v":2},{"$f":"'FEUILLE de SAISIE'!P192","v":7},{"$f":"'FEUILLE de SAISIE'!Q192","v":0},{"$f":"'FEUILLE de SAISIE'!R192","v":3},{"$f":"'FEUILLE de SAISIE'!S192","v":1},{"$f":"'FEUILLE de SAISIE'!T192","v":3},{"$f":"'FEUILLE de SAISIE'!U192","v":1},{"$f":"'FEUILLE de SAISIE'!V192","v":0},{"$f":"'FEUILLE de SAISIE'!W192","v":1},9,20,23,{"$f":"AA10-14","v":9}]
[null," TOTAUX CDJE 79",{"$f":"SUM(C7:C10)","v":1},2,5,0,0,3,1,5,6,1,16,24,7,18,28,2,7,6,13,19,23,16,86,139,163,{"$f":"SUM(AB7:AB10)","v":12}]

{"sheet":"86","index":9,"n_rows":11,"n_cols":28,"rows_kept":11,"cut":false,"hidden":false,"merged":[[2,1,2,27],[3,26,3,27],[4,27,5,27],[3,7,3,17],[4,1,5,1],[4,13,5,13],[4,25,5,25],[4,26,5,26]]}
[]
[]
[null,"ADHÉRENTS  NOUVELLE  AQUITAINE  2017 - 2018"]
[null,null,null,null,null,null,null,"VIENNE (86)"]
[null,"CLUBS","S65","S50",null,"U20","U18","U16","U14","U12","U10","U8","Total","TF","S65","S50",null,"U20","U18","U16","U14","U12","U10","U8","Total","TM ","TOTAL","Var."]
[null,null,"VF","SF+","SF","JF","CF","MF","BF","PuF","PoF","PpF","JeunesF",null,"VM","SM+","SM","JM","CM","MM","BM","PuM","PoM","PpM","JeunesM"]
[null," Échiquier Poitevin",{"$f":"'FEUILLE de SAISIE'!D197","v":3},{"$f":"'FEUILLE de SAISIE'!E197","v":0},{"$f":"'FEUILLE de SAISIE'!F197","v":2},{"$f":"'FEUILLE de SAISIE'!G197","v":0},{"$f":"'FEUILLE de SAISIE'!H197","v":0},{"$f":"'FEUILLE de SAISIE'!I197","v":0},{"$f":"'FEUILLE de SAISIE'!J197","v":0},{"$f":"'FEUILLE de SAISIE'!K197","v":0},{"$f":"'FEUILLE de SAISIE'!L197","v":1},{"$f":"'FEUILLE de SAISIE'!M197","v":0},{"$f":"SUM(F7:L7)","v":1},{"$f":"SUM(C7:L7)","v":6},{"$f":"'FEUILLE de SAISIE'!N197","v":5},{"$f":"'FEUILLE de SAISIE'!O197","v":7},{"$f":"'FEUILLE de SAISIE'!P197","v":9},{"$f":"'FEUILLE de SAISIE'!Q197","v":0},{"$f":"'FEUILLE de SAISIE'!R197","v":0},{"$f":"'FEUILLE de SAISIE'!S197","v":2},{"$f":"'FEUILLE de SAISIE'!T197","v":6},{"$f":"'FEUILLE de SAISIE'!U197","v":7},{"$f":"'FEUILLE de SAISIE'!V197","v":1},{"$f":"'FEUILLE de SAISIE'!W197","v":5},{"$f":"SUM(R7:X7)","v":21},{"$f":"SUM(O7:X7)","v":42},{"$f":"N7+Z7","v":48},{"$f":"AA7-47","v":1}]
[null," C.E. Chatelleraudais",{"$f":"'FEUILLE de SAISIE'!D199","v":0},{"$f":"'FEUILLE de SAISIE'!E199","v":0},{"$f":"'FEUILLE de SAISIE'!F199","v":0},{"$f":"'FEUILLE de SAISIE'!G199","v":0},{"$f":"'FEUILLE de SAISIE'!H199","v":0},{"$f":"'FEUILLE de SAISIE'!I199","v":0},{"$f":"'FEUILLE de SAISIE'!J199","v":0},{"$f":"'FEUILLE de SAISIE'!K199","v":0},{"$f":"'FEUILLE de SAISIE'!L199","v":0},{"$f":"'FEUILLE de SAISIE'!M199","v":0},{"$f":"SUM(F8:L8)","v":0},{"$f":"SUM(C8:L8)","v":0},{"$f":"'FEUILLE de SAISIE'!N199","v":2},{"$f":"'FEUILLE de SAISIE'!O199","v":1},{"$f":"'FEUILLE de SAISIE'!P199","v":0},{"$f":"'FEUILLE de SAISIE'!Q199","v":0},{"$f":"'FEUILLE de SAISIE'!R199","v":0},{"$f":"'FEUILLE de SAISIE'!S199","v":0},{"$f":"'FEUILLE de SAISIE'!T199","v":1},{"$f":"'FEUILLE de SAISIE'!U199","v":0},{"$f":"'FEUILLE de SAISIE'!V199","v":0},{"$f":"'FEUILLE de SAISIE'!W199","v":1},{"$f":"SUM(R8:X8)","v":2},{"$f":"SUM(O8:X8)","v":5},{"$f":"N8+Z8","v":5},{"$f":"AA8-47","v":-42}]
[null," Poitiers-Migne Échecs",{"$f":"'FEUILLE de SAISIE'!D201","v":0},{"$f":"'FEUILLE de SAISIE'!E201","v":1},{"$f":"'FEUILLE de SAISIE'!F201","v":1},{"$f":"'FEUILLE de SAISIE'!G201","v":1},{"$f":"'FEUILLE de SAISIE'!H201","v":0},{"$f":"'FEUILLE de SAISIE'!I201","v":0},{"$f":"'FEUILLE de SAISIE'!J201","v":1},{"$f":"'FEUILLE de SAISIE'!K201","v":0},{"$f":"'FEUILLE de SAISIE'!L201","v":0},{"$f":"'FEUILLE de SAISIE'!M201","v":0},2,{"$f":"SUM(C9:L9)","v":4},{"$f":"'FEUILLE de SAISIE'!N201","v":3},{"$f":"'FEUILLE de SAISIE'!O201","v":1},{"$f":"'FEUILLE de SAISIE'!P201","v":17},{"$f":"'FEUILLE de SAISIE'!Q201","v":1},{"$f":"'FEUILLE de SAISIE'!R201","v":1},{"$f":"'FEUILLE de SAISIE'!S201","v":4},{"$f":"'FEUILLE de SAISIE'!T201","v":1},{"$f":"'FEUILLE de SAISIE'!U201","v":3},{"$f":"'FEUILLE de SAISIE'!V201","v":0},{"$f":"'FEUILLE de SAISIE'!W201","v":0},10,31,35,-12]
[null," Rois et Dames des Trois Cités",{"$f":"'FEUILLE de SAISIE'!D203","v":0},{"$f":"'FEUILLE de SAISIE'!E203","v":1},{"$f":"'FEUILLE de SAISIE'!F203","v":0},{"$f":"'FEUILLE de SAISIE'!G203","v":0},{"$f":"'FEUILLE de SAISIE'!H203","v":0},{"$f":"'FEUILLE de SAISIE'!I203","v":0},{"$f":"'FEUILLE de SAISIE'!J203","v":0},{"$f":"'FEUILLE de SAISIE'!K203","v":0},{"$f":"'FEUILLE de SAISIE'!L203","v":0},{"$f":"'FEUILLE de SAISIE'!M203","v":0},0,1,{"$f":"'FEUILLE de SAISIE'!N203","v":2},{"$f":"'FEUILLE de SAISIE'!O203","v":6},{"$f":"'FEUILLE de SAISIE'!P203","v":8},{"$f":"'FEUILLE de SAISIE'!Q203","v":0},{"$f":"'FEUILLE de SAISIE'!R203","v":0},{"$f":"'FEUILLE de SAISIE'!S203","v":2},{"$f":"'FEUILLE de SAISIE'!T203","v":0},{"$f":"'FEUILLE de SAISIE'!U203","v":1},{"$f":"'FEUILLE de SAISIE'!V203","v":1},{"$f":"'FEUILLE de SAISIE'!W203","v":0},4,20,21,-26]
[null," TOTAUX CDJE 86",{"$f":"SUM(C7:C10)","v":3},2,3,1,0,0,1,0,1,0,3,11,12,15,34,1,1,8,8,11,2,6,37,98,109,{"$f":"SUM(AB7:AB10)","v":-79}]

{"sheet":"TOTAUX CP","index":10,"n_rows":13,"n_cols":29,"rows_kept":13,"cut":false,"hidden":false,"merged":[[4,28,5,28],[2,1,3,28],[12,1,12,15],[12,19,12,22],[4,1,5,1],[4,13,5,13],[4,25,5,25],[4,26,5,26],[4,27,5,27]]}
[]
[]
[null,"ADHÉRENTS  de  CHARENTES-POITOU  2017 - 2018"]
[]
[null,"CDJE","S65","S50",null,"U20","U18","U16","U14","U12","U10","U8","Total","TF","S65","S50",null,"U20","U18","U16","U14","U12","U10","U8","Total","TM ","TOTAL","Écarts","Nb de clubs"]
[null,null,"VF","SF+","SF","JF","CF","MF","BF","PuF","PoF","PpF","Jeunes F",null,"VM","SM+","SM","JM","CM","MM","BM","PuM","PoM","PpM","Jeunes M"]
[null,"  CDJE 16",{"$f":"'16'!C13","v":3},{"$f":"'16'!D13","v":1},{"$f":"'16'!E13","v":2},{"$f":"'16'!F13","v":0},{"$f":"'16'!G13","v":0},{"$f":"'16'!H13","v":3},{"$f":"'16'!I13","v":2},{"$f":"'16'!J13","v":3},{"$f":"'16'!K13","v":12},{"$f":"'16'!L13","v":4},{"$f":"SUM(F7:L7)","v":24},{"$f":"SUM(C7:L7)","v":30},{"$f":"'16'!O13","v":16},{"$f":"'16'!P13","v":27},{"$f":"'16'!Q13","v":38},{"$f":"'16'!R13","v":1},{"$f":"'16'!S13","v":4},{"$f":"'16'!T13","v":4},{"$f":"'16'!U13","v":7},{"$f":"'16'!V13","v":38},{"$f":"'16'!W13","v":50},{"$f":"'16'!X13","v":7},{"$f":"SUM(R7:X7)","v":111},{"$f":"SUM(O7:X7)","v":192},{"$f":"N7+Z7","v":222},{"$f":"AA7-201","v":21},6]
[null,"  CDJE 17",{"$f":"'17'!C12","v":1},{"$f":"'17'!D12","v":4},{"$f":"'17'!E12","v":7},{"$f":"'17'!F12","v":0},{"$f":"'17'!G12","v":1},{"$f":"'17'!H12","v":2},{"$f":"'17'!I12","v":5},{"$f":"'17'!J12","v":14},{"$f":"'17'!K12","v":20},{"$f":"'17'!L12","v":10},{"$f":"SUM(F8:L8)","v":52},{"$f":"SUM(C8:L8)","v":64},{"$f":"'17'!O12","v":17},{"$f":"'17'!P12","v":43},{"$f":"'17'!Q12","v":29},{"$f":"'17'!R12","v":1},{"$f":"'17'!S12","v":10},{"$f":"'17'!T12","v":12},{"$f":"'17'!U12","v":22},{"$f":"'17'!V12","v":49},{"$f":"'17'!W12","v":58},{"$f":"'17'!X12","v":25},{"$f":"SUM(R8:X8)","v":177},{"$f":"SUM(O8:X8)","v":266},{"$f":"N8+Z8","v":330},{"$f":"AA8-298","v":32},5]
[null,"  CDJE 79",{"$f":"'79'!C11","v":1},{"$f":"'79'!D11","v":2},{"$f":"'79'!E11","v":5},{"$f":"'79'!F11","v":0},{"$f":"'79'!G11","v":0},{"$f":"'79'!H11","v":3},{"$f":"'79'!I11","v":1},{"$f":"'79'!J11","v":5},{"$f":"'79'!K11","v":6},{"$f":"'79'!L11","v":1},16,24,{"$f":"'79'!O11","v":7},{"$f":"'79'!P11","v":18},{"$f":"'79'!Q11","v":28},{"$f":"'79'!R11","v":2},{"$f":"'79'!S11","v":7},{"$f":"'79'!T11","v":6},{"$f":"'79'!U11","v":13},{"$f":"'79'!V11","v":19},{"$f":"'79'!W11","v":23},{"$f":"'79'!X11","v":16},86,139,163,{"$f":"AA9-161","v":2},4]
[null,"  CDJE 86",{"$f":"'86'!C11","v":3},{"$f":"'86'!D11","v":2},{"$f":"'86'!E11","v":3},{"$f":"'86'!F11","v":1},{"$f":"'86'!G11","v":0},{"$f":"'86'!H11","v":0},{"$f":"'86'!I11","v":1},{"$f":"'86'!J11","v":0},{"$f":"'86'!K11","v":1},{"$f":"'86'!L11","v":0},3,11,{"$f":"'86'!O11","v":12},{"$f":"'86'!P11","v":15},{"$f":"'86'!Q11","v":34},{"$f":"'86'!R11","v":1},{"$f":"'86'!S11","v":1},{"$f":"'86'!T11","v":8},{"$f":"'86'!U11","v":8},{"$f":"'86'!V11","v":11},{"$f":"'86'!W11","v":2},{"$f":"'86'!X11","v":6},37,98,109,{"$f":"AA10-125","v":-16},4]
[null," TOTAUX CHARENTES-POITOU",{"$f":"SUM(C7:C10)","v":8},9,17,1,1,8,9,22,39,15,95,129,52,103,129,5,22,30,50,117,133,54,411,695,824,39,{"$f":"SUM(AC7:AC10)","v":19}]
[]
[null,"(T= total; V= vétéran; S= sénior; J= junior; C= cadet; M= minime; B= benjamin; Po= poussin; Pp= petit poussin; F= féminin; M= masculin )",null,null,null,null,null,null,null,null,null,null,null,null,null,null,null,null,null,"Au 31 août 2018"]

{"sheet":"19","index":11,"n_rows":14,"n_cols":28,"rows_kept":14,"cut":false,"hidden":false,"merged":[[2,1,2,27],[3,26,3,27],[4,27,5,27],[3,8,3,14],[4,1,5,1],[4,13,5,13],[4,25,5,25],[4,26,5,26]]}
[]
[]
[null,"ADHÉRENTS  NOUVELLE  AQUITAINE  2017 - 2018"]
[null,null,null,null,null,null,null,null,"CORRÈZE (19)"]
[null,"CLUBS","S65","S50",null,"U20","U18","U16","U14","U12","U10","U8","Total","TF","S65","S50",null,"U20","U18","U16","U14","U12","U10","U8","Total","TM ","TOTAL","Var."]
[null,null,"VF","SF+","SF","JF","CF","MF","BF","PuF","PoF","PpF","JeunesF",null,"VM","SM+","SM","JM","CM","MM","BM","PuM","PoM","PpM","JeunesM"]
[null," Collège d'Argentat",{"$f":"'FEUILLE de SAISIE'!D207","v":0},{"$f":"'FEUILLE de SAISIE'!E207","v":0},{"$f":"'FEUILLE de SAISIE'!F207","v":0},{"$f":"'FEUILLE de SAISIE'!G207","v":0},{"$f":"'FEUILLE de SAISIE'!H207","v":0},{"$f":"'FEUILLE de SAISIE'!I207","v":1},{"$f":"'FEUILLE de SAISIE'!J207","v":5},{"$f":"'FEUILLE de SAISIE'!K207","v":1},{"$f":"'FEUILLE de SAISIE'!L207","v":0},{"$f":"'FEUILLE de SAISIE'!M207","v":0},{"$f":"SUM(F7:L7)","v":7},{"$f":"SUM(C7:L7)","v":7},{"$f":"'FEUILLE de SAISIE'!N207","v":0},{"$f":"'FEUILLE de SAISIE'!O207","v":0},{"$f":"'FEUILLE de SAISIE'!P207","v":1},{"$f":"'FEUILLE de SAISIE'!Q207","v":0},{"$f":"'FEUILLE de SAISIE'!R207","v":0},{"$f":"'FEUILLE de SAISIE'!S207","v":2},{"$f":"'FEUILLE de SAISIE'!T207","v":4},{"$f":"'FEUILLE de SAISIE'!U207","v":1},{"$f":"'FEUILLE de SAISIE'!V207","v":0},{"$f":"'FEUILLE de SAISIE'!W207","v":0},{"$f":"SUM(R7:X7)","v":7},{"$f":"SUM(O7:X7)","v":8},{"$f":"N7+Z7","v":15},{"$f":"AA7-19","v":-4}]
[null," Brive Le Cavalier Gaillard",{"$f":"'FEUILLE de SAISIE'!D212","v":0},{"$f":"'FEUILLE de SAISIE'!E212","v":1},{"$f":"'FEUILLE de SAISIE'!F212","v":1},{"$f":"'FEUILLE de SAISIE'!G212","v":0},{"$f":"'FEUILLE de SAISIE'!H212","v":2},{"$f":"'FEUILLE de SAISIE'!I212","v":1},{"$f":"'FEUILLE de SAISIE'!J212","v":3},{"$f":"'FEUILLE de SAISIE'!K212","v":6},{"$f":"'FEUILLE de SAISIE'!L212","v":2},{"$f":"'FEUILLE de SAISIE'!M212","v":2},{"$f":"SUM(F8:L8)","v":16},{"$f":"SUM(C8:L8)","v":18},{"$f":"'FEUILLE de SAISIE'!N212","v":1},{"$f":"'FEUILLE de SAISIE'!O212","v":8},{"$f":"'FEUILLE de SAISIE'!P212","v":8},{"$f":"'FEUILLE de SAISIE'!Q212","v":3},{"$f":"'FEUILLE de SAISIE'!R212","v":2},{"$f":"'FEUILLE de SAISIE'!S212","v":10},{"$f":"'FEUILLE de SAISIE'!T212","v":9},{"$f":"'FEUILLE de SAISIE'!U212","v":26},{"$f":"'FEUILLE de SAISIE'!V212","v":10},{"$f":"'FEUILLE de SAISIE'!W212","v":6},{"$f":"SUM(R8:X8)","v":66},{"$f":"SUM(O8:X8)","v":83},{"$f":"N8+Z8","v":101},{"$f":"AA8-86","v":15}]
[null," Alekhine Brive Chess CE de Brive",{"$f":"'FEUILLE de SAISIE'!D214","v":0},{"$f":"'FEUILLE de SAISIE'!E214","v":0},{"$f":"'FEUILLE de SAISIE'!F214","v":0},{"$f":"'FEUILLE de SAISIE'!G214","v":0},{"$f":"'FEUILLE de SAISIE'!H214","v":0},{"$f":"'FEUILLE de SAISIE'!I214","v":0},{"$f":"'FEUILLE de SAISIE'!J214","v":1},{"$f":"'FEUILLE de SAISIE'!K214","v":0},{"$f":"'FEUILLE de SAISIE'!L214","v":0},{"$f":"'FEUILLE de SAISIE'!M214","v":0},1,1,{"$f":"'FEUILLE de SAISIE'!N214","v":0},{"$f":"'FEUILLE de SAISIE'!O214","v":0},{"$f":"'FEUILLE de SAISIE'!P214","v":1},{"$f":"'FEUILLE de SAISIE'!Q214","v":0},{"$f":"'FEUILLE de SAISIE'!R214","v":0},{"$f":"'FEUILLE de SAISIE'!S214","v":0},{"$f":"'FEUILLE de SAISIE'!T214","v":1},{"$f":"'FEUILLE de SAISIE'!U214","v":0},{"$f":"'FEUILLE de SAISIE'!V214","v":1},{"$f":"'FEUILLE de SAISIE'!W214","v":1},3,4,5,{"$f":"AA9-5","v":0}]
[null," Cercle d'Échecs d'Égletons",{"$f":"'FEUILLE de SAISIE'!D218","v":0},{"$f":"'FEUILLE de SAISIE'!E218","v":0},{"$f":"'FEUILLE de SAISIE'!F218","v":0},{"$f":"'FEUILLE de SAISIE'!G218","v":0},{"$f":"'FEUILLE de SAISIE'!H218","v":0},{"$f":"'FEUILLE de SAISIE'!I218","v":1},{"$f":"'FEUILLE de SAISIE'!J218","v":7},{"$f":"'FEUILLE de SAISIE'!K218","v":7},{"$f":"'FEUILLE de SAISIE'!L218","v":0},{"$f":"'FEUILLE de SAISIE'!M218","v":1},16,16,{"$f":"'FEUILLE de SAISIE'!N218","v":2},{"$f":"'FEUILLE de SAISIE'!O218","v":2},{"$f":"'FEUILLE de SAISIE'!P218","v":0},{"$f":"'FEUILLE de SAISIE'!Q218","v":0},{"$f":"'FEUILLE de SAISIE'!R218","v":0},{"$f":"'FEUILLE de SAISIE'!S218","v":6},{"$f":"'FEUILLE de SAISIE'!T218","v":9},{"$f":"'FEUILLE de SAISIE'!U218","v":18},{"$f":"'FEUILLE de SAISIE'!V218","v":3},{"$f":"'FEUILLE de SAISIE'!W218","v":2},38,42,58,{"$f":"AA10-44","v":14}]
[null," Meyssac Échecs",{"$f":"'FEUILLE de SAISIE'!D220","v":2},{"$f":"'FEUILLE de SAISIE'!E220","v":1},{"$f":"'FEUILLE de SAISIE'!F220","v":0},{"$f":"'FEUILLE de SAISIE'!G220","v":0},{"$f":"'FEUILLE de SAISIE'!H220","v":0},{"$f":"'FEUILLE de SAISIE'!I220","v":0},{"$f":"'FEUILLE de SAISIE'!J220","v":2},{"$f":"'FEUILLE de SAISIE'!K220","v":1},{"$f":"'FEUILLE de SAISIE'!L220","v":1},{"$f":"'FEUILLE de SAISIE'!M220","v":1},5,8,{"$f":"'FEUILLE de SAISIE'!N220","v":8},{"$f":"'FEUILLE de SAISIE'!O220","v":5},{"$f":"'FEUILLE de SAISIE'!P220","v":3},{"$f":"'FEUILLE de SAISIE'!Q220","v":0},{"$f":"'FEUILLE de SAISIE'!R220","v":1},{"$f":"'FEUILLE de SAISIE'!S220","v":2},{"$f":"'FEUILLE de SAISIE'!T220","v":4},{"$f":"'FEUILLE de SAISIE'!U220","v":1},{"$f":"'FEUILLE de SAISIE'!V220","v":2},{"$f":"'FEUILLE de SAISIE'!W220","v":1},11,27,35,{"$f":"AA11-45","v":-10}]
[null," Club d'Échecs du Pays de Brive",{"$f":"'FEUILLE de SAISIE'!D225","v":0},{"$f":"'FEUILLE de SAISIE'!E225","v":1},{"$f":"'FEUILLE de SAISIE'!F225","v":2},{"$f":"'FEUILLE de SAISIE'!G225","v":0},{"$f":"'FEUILLE de SAISIE'!H225","v":0},{"$f":"'FEUILLE de SAISIE'!I225","v":2},{"$f":"'FEUILLE de SAISIE'!J225","v":3},{"$f":"'FEUILLE de SAISIE'!K225","v":7},{"$f":"'FEUILLE de SAISIE'!L225","v":3},{"$f":"'FEUILLE de SAISIE'!M225","v":0},15,18,{"$f":"'FEUILLE de SAISIE'!N225","v":1},{"$f":"'FEUILLE de SAISIE'!O225","v":4},{"$f":"'FEUILLE de SAISIE'!P225","v":5},{"$f":"'FEUILLE de SAISIE'!Q225","v":0},{"$f":"'FEUILLE de SAISIE'!R225","v":1},{"$f":"'FEUILLE de SAISIE'!S225","v":3},{"$f":"'FEUILLE de SAISIE'!T225","v":20},{"$f":"'FEUILLE de SAISIE'!U225","v":28},{"$f":"'FEUILLE de SAISIE'!V225","v":11},{"$f":"'FEUILLE de SAISIE'!W225","v":13},76,86,104,{"$f":"AA12-144","v":-40}]
[null," Échiquier Tulliste",{"$f":"'FEUILLE de SAISIE'!D227","v":2},{"$f":"'FEUILLE de SAISIE'!E227","v":0},{"$f":"'FEUILLE de SAISIE'!F227","v":1},{"$f":"'FEUILLE de SAISIE'!G227","v":0},{"$f":"'FEUILLE de SAISIE'!H227","v":0},{"$f":"'FEUILLE de SAISIE'!I227","v":0},{"$f":"'FEUILLE de SAISIE'!J227","v":0},{"$f":"'FEUILLE de SAISIE'!K227","v":1},{"$f":"'FEUILLE de SAISIE'!L227","v":0},{"$f":"'FEUILLE de SAISIE'!M227","v":0},1,4,{"$f":"'FEUILLE de SAISIE'!N227","v":0},{"$f":"'FEUILLE de SAISIE'!O227","v":0},{"$f":"'FEUILLE de SAISIE'!P227","v":4},{"$f":"'FEUILLE de SAISIE'!Q227","v":1},{"$f":"'FEUILLE de SAISIE'!R227","v":0},{"$f":"'FEUILLE de SAISIE'!S227","v":1},{"$f":"'FEUILLE de SAISIE'!T227","v":1},{"$f":"'FEUILLE de SAISIE'!U227","v":2},{"$f":"'FEUILLE de SAISIE'!V227","v":0},{"$f":"'FEUILLE de SAISIE'!W227","v":0},5,9,13,{"$f":"AA13-11","v":2}]
[null," TOTAUX CDJE 19",{"$f":"SUM(C7:C13)","v":4},{"$f":"SUM(D7:D13)","v":3},4,0,2,5,21,23,6,4,61,72,12,19,22,4,4,24,48,76,27,23,206,259,331,{"$f":"SUM(AB7:AB13)","v":-23}]

{"sheet":"23","index":12,"n_rows":8,"n_cols":28,"rows_kept":8,"cut":false,"hidden":false,"merged":[[2,1,2,27],[3,26,3,27],[4,27,5,27],[3,8,3,14],[4,1,5,1],[4,13,5,13],[4,25,5,25],[4,26,5,26]]}
[]
[]
[null,"ADHÉRENTS  NOUVELLE  AQUITAINE  2017 - 2018"]
[null,null,null,null,null,null,null,null,"CREUSE (23)"]
[null,"CLUBS","S65","S50",null,"U20","U18","U16","U14","U12","U10","U8","Total","TF","S65","S50",null,"U20","U18","U16","U14","U12","U10","U8","Total","TM ","TOTAL","Var."]
[null,null,"VF","SF+","SF","JF","CF","MF","BF","PuF","PoF","PpF","JeunesF",null,"VM","SM+","SM","JM","CM","MM","BM","PuM","PoM","PpM","JeunesM"]
[null," Creuse-Échecs",{"$f":"'FEUILLE de SAISIE'!D230","v":0},{"$f":"'FEUILLE de SAISIE'!E230","v":1},{"$f":"'FEUILLE de SAISIE'!F230","v":1},{"$f":"'FEUILLE de SAISIE'!G230","v":0},{"$f":"'FEUILLE de SAISIE'!H230","v":0},{"$f":"'FEUILLE de SAISIE'!I230","v":0},{"$f":"'FEUILLE de SAISIE'!J230","v":0},{"$f":"'FEUILLE de SAISIE'!K230","v":0},{"$f":"'FEUILLE de SAISIE'!L230","v":0},{"$f":"'FEUILLE de SAISIE'!M230","v":0},{"$f":"SUM(F7:L7)","v":0},{"$f":"SUM(C7:L7)","v":2},{"$f":"'FEUILLE de SAISIE'!N230","v":0},{"$f":"'FEUILLE de SAISIE'!O230","v":3},{"$f":"'FEUILLE de SAISIE'!P230","v":2},{"$f":"'FEUILLE de SAISIE'!Q230","v":0},{"$f":"'FEUILLE de SAISIE'!R230","v":0},{"$f":"'FEUILLE de SAISIE'!S230","v":0},{"$f":"'FEUILLE de SAISIE'!T230","v":1},{"$f":"'FEUILLE de SAISIE'!U230","v":1},{"$f":"'FEUILLE de SAISIE'!V230","v":1},{"$f":"'FEUILLE de SAISIE'!W230","v":0},{"$f":"SUM(R7:X7)","v":3},{"$f":"SUM(O7:X7)","v":8},{"$f":"N7+Z7","v":10},{"$f":"AA7-83","v":-73}]
[null," TOTAUX CDJE 23",{"$f":"C7","v":0},{"$f":"D7","v":1},1,0,0,0,0,0,0,0,0,2,0,3,2,0,0,0,1,1,1,0,3,8,10,{"$f":"SUM(AB7)","v":-73}]

{"sheet":"87","index":13,"n_rows":12,"n_cols":28,"rows_kept":12,"cut":false,"hidden":false,"merged":[[3,1,3,27],[4,26,4,27],[5,27,6,27],[4,8,4,14],[5,1,6,1],[5,13,6,13],[5,25,6,25],[5,26,6,26]]}
[]
[]
[]
[null,"ADHÉRENTS  NOUVELLE  AQUITAINE  2017 - 2018"]
[null,null,null,null,null,null,null,null,"HAUTE  VIENNE (87)"]
[null,"CLUBS","S65","S50",null,"U20","U18","U16","U14","U12","U10","U8","Total","TF","S65","S50",null,"U20","U18","U16","U14","U12","U10","U8","Total","TM ","TOTAL","Var."]
[null,null,"VF","SF+","SF","JF","CF","MF","BF","PuF","PoF","PpF","JeunesF",null,"VM","SM+","SM","JM","CM","MM","BM","PuM","PoM","PpM","JeunesM"]
[null," Couzeix Chess Club (C3)",{"$f":"'FEUILLE de SAISIE'!D232","v":0},{"$f":"'FEUILLE de SAISIE'!E232","v":0},{"$f":"'FEUILLE de SAISIE'!F232","v":1},{"$f":"'FEUILLE de SAISIE'!G232","v":0},{"$f":"'FEUILLE de SAISIE'!H232","v":0},{"$f":"'FEUILLE de SAISIE'!I232","v":0},{"$f":"'FEUILLE de SAISIE'!J232","v":0},{"$f":"'FEUILLE de SAISIE'!K232","v":0},{"$f":"'FEUILLE de SAISIE'!L232","v":4},{"$f":"'FEUILLE de SAISIE'!M232","v":1},{"$f":"SUM(F8:L8)","v":5},{"$f":"SUM(C8:L8)","v":6},{"$f":"'FEUILLE de SAISIE'!N232","v":1},{"$f":"'FEUILLE de SAISIE'!O232","v":5},{"$f":"'FEUILLE de SAISIE'!P232","v":7},{"$f":"'FEUILLE de SAISIE'!Q232","v":0},{"$f":"'FEUILLE de SAISIE'!R232","v":0},{"$f":"'FEUILLE de SAISIE'!S232","v":2},{"$f":"'FEUILLE de SAISIE'!T232","v":4},{"$f":"'FEUILLE de SAISIE'!U232","v":2},{"$f":"'FEUILLE de SAISIE'!V232","v":8},{"$f":"'FEUILLE de SAISIE'!W232","v":1},{"$f":"SUM(R8:X8)","v":17},{"$f":"SUM(O8:X8)","v":30},{"$f":"N8+Z8","v":36},{"$f":"AA8-31","v":5}]
[null," Isle Échecs",{"$f":"'FEUILLE de SAISIE'!D234","v":0},{"$f":"'FEUILLE de SAISIE'!E234","v":0},{"$f":"'FEUILLE de SAISIE'!F234","v":0},{"$f":"'FEUILLE de SAISIE'!G234","v":0},{"$f":"'FEUILLE de SAISIE'!H234","v":0},{"$f":"'FEUILLE de SAISIE'!I234","v":0},{"$f":"'FEUILLE de SAISIE'!J234","v":0},{"$f":"'FEUILLE de SAISIE'!K234","v":0},{"$f":"'FEUILLE de SAISIE'!L234","v":3},{"$f":"'FEUILLE de SAISIE'!M234","v":2},{"$f":"SUM(F9:L9)","v":5},{"$f":"SUM(C9:L9)","v":5},{"$f":"'FEUILLE de SAISIE'!N234","v":4},{"$f":"'FEUILLE de SAISIE'!O234","v":4},{"$f":"'FEUILLE de SAISIE'!P234","v":2},{"$f":"'FEUILLE de SAISIE'!Q234","v":0},{"$f":"'FEUILLE de SAISIE'!R234","v":0},{"$f":"'FEUILLE de SAISIE'!S234","v":1},{"$f":"'FEUILLE de SAISIE'!T234","v":2},{"$f":"'FEUILLE de SAISIE'!U234","v":2},{"$f":"'FEUILLE de SAISIE'!V234","v":1},{"$f":"'FEUILLE de SAISIE'!W234","v":1},{"$f":"SUM(R9:X9)","v":7},{"$f":"SUM(O9:X9)","v":17},{"$f":"N9+Z9","v":22},{"$f":"AA9-7","v":15}]
[null," LEC Échiquier Limousin",{"$f":"'FEUILLE de SAISIE'!D241","v":1},{"$f":"'FEUILLE de SAISIE'!E241","v":2},{"$f":"'FEUILLE de SAISIE'!F241","v":3},{"$f":"'FEUILLE de SAISIE'!G241","v":0},{"$f":"'FEUILLE de SAISIE'!H241","v":5},{"$f":"'FEUILLE de SAISIE'!I241","v":2},{"$f":"'FEUILLE de SAISIE'!J241","v":2},{"$f":"'FEUILLE de SAISIE'!K241","v":5},{"$f":"'FEUILLE de SAISIE'!L241","v":8},{"$f":"'FEUILLE de SAISIE'!M241","v":0},{"$f":"SUM(F10:L10)","v":22},28,{"$f":"'FEUILLE de SAISIE'!N241","v":5},{"$f":"'FEUILLE de SAISIE'!O241","v":17},{"$f":"'FEUILLE de SAISIE'!P241","v":31},{"$f":"'FEUILLE de SAISIE'!Q241","v":4},{"$f":"'FEUILLE de SAISIE'!R241","v":10},{"$f":"'FEUILLE de SAISIE'!S241","v":7},{"$f":"'FEUILLE de SAISIE'!T241","v":15},{"$f":"'FEUILLE de SAISIE'!U241","v":23},{"$f":"'FEUILLE de SAISIE'!V241","v":18},{"$f":"'FEUILLE de SAISIE'!W241","v":10},87,140,168,{"$f":"AA10-188","v":-20}]
[null," ASSJ Échecs-Cercle Philidor Saint Junien",{"$f":"'FEUILLE de SAISIE'!D243","v":0},{"$f":"'FEUILLE de SAISIE'!E243","v":0},{"$f":"'FEUILLE de SAISIE'!F243","v":0},{"$f":"'FEUILLE de SAISIE'!G243","v":0},{"$f":"'FEUILLE de SAISIE'!H243","v":0},{"$f":"'FEUILLE de SAISIE'!I243","v":0},{"$f":"'FEUILLE de SAISIE'!J243","v":0},{"$f":"'FEUILLE de SAISIE'!K243","v":1},{"$f":"'FEUILLE de SAISIE'!L243","v":0},{"$f":"'FEUILLE de SAISIE'!M243","v":0},{"$f":"SUM(F11:L11)","v":1},1,{"$f":"'FEUILLE de SAISIE'!N243","v":1},{"$f":"'FEUILLE de SAISIE'!O243","v":1},{"$f":"'FEUILLE de SAISIE'!P243","v":0},{"$f":"'FEUILLE de SAISIE'!Q243","v":0},{"$f":"'FEUILLE de SAISIE'!R243","v":0},{"$f":"'FEUILLE de SAISIE'!S243","v":2},{"$f":"'FEUILLE de SAISIE'!T243","v":0},{"$f":"'FEUILLE de SAISIE'!U243","v":0},{"$f":"'FEUILLE de SAISIE'!V243","v":1},{"$f":"'FEUILLE de SAISIE'!W243","v":0},3,5,6,{"$f":"AA11-7","v":-1}]
[null," TOTAUX CDJE 87",{"$f":"SUM(C8:C11)","v":1},{"$f":"SUM(D8:D11)","v":2},4,0,5,2,2,6,15,3,33,40,11,27,40,4,10,12,21,27,28,12,114,{"$f":"SUM(Z9:Z11)","v":162},232,{"$f":"SUM(AB8:AB11)","v":-1}]

{"sheet":"TOTAUX LIM","index":14,"n_rows":12,"n_cols":29,"rows_kept":12,"cut":false,"hidden":false,"merged":[[4,28,5,28],[2,1,3,28],[11,1,11,15],[11,19,11,22],[4,1,5,1],[4,13,5,13],[4,25,5,25],[4,26,5,26],[4,27,5,27]]}
[]
[]
[null,"ADHÉRENTS  du  LIMOUSIN  2017 - 2018"]
[]
[null,"CDJE","S65","S50",null,"U20","U18","U16","U14","U12","U10","U8","Total","TF","S65","S50",null,"U20","U18","U16","U14","U12","U10","U8","Total","TM ","TOTAL","Écarts","Nb de clubs"]
[null,null,"VF","SF+","SF","JF","CF","MF","BF","PuF","PoF","PpF","Jeunes F",null,"VM","SM+","SM","JM","CM","MM","BM","PuM","PoM","PpM","Jeunes M"]
[null,"  CDJE 19",{"$f":"'19'!C14","v":4},{"$f":"'19'!D14","v":3},{"$f":"'19'!E14","v":4},{"$f":"'19'!F14","v":0},{"$f":"'19'!G14","v":2},{"$f":"'19'!H14","v":5},{"$f":"'19'!I14","v":21},{"$f":"'19'!J14","v":23},{"$f":"'19'!K14","v":6},{"$f":"'19'!L14","v":4},{"$f":"SUM(F7:L7)","v":61},{"$f":"SUM(C7:L7)","v":72},{"$f":"'19'!O14","v":12},{"$f":"'19'!P14","v":19},{"$f":"'19'!Q14","v":22},{"$f":"'19'!R14","v":4},{"$f":"'19'!S14","v":4},{"$f":"'19'!T14","v":24},{"$f":"'19'!U14","v":48},{"$f":"'19'!V14","v":76},{"$f":"'19'!W14","v":27},{"$f":"'19'!X14","v":23},{"$f":"SUM(R7:X7)","v":206},{"$f":"SUM(O7:X7)","v":259},{"$f":"N7+Z7","v":331},{"$f":"AA7-354","v":-23},7]
[null,"  CDJE 23",{"$f":"'23'!C8","v":0},{"$f":"'23'!D8","v":1},{"$f":"'23'!E8","v":1},{"$f":"'23'!F8","v":0},{"$f":"'23'!G8","v":0},{"$f":"'23'!H8","v":0},{"$f":"'23'!I8","v":0},{"$f":"'23'!J8","v":0},{"$f":"'23'!K8","v":0},{"$f":"'23'!L8","v":0},{"$f":"SUM(F8:L8)","v":0},{"$f":"SUM(C8:L8)","v":2},{"$f":"'23'!O8","v":0},{"$f":"'23'!P8","v":3},{"$f":"'23'!Q8","v":2},{"$f":"'23'!R8","v":0},{"$f":"'23'!S8","v":0},{"$f":"'23'!T8","v":0},{"$f":"'23'!U8","v":1},{"$f":"'23'!V8","v":1},{"$f":"'23'!W8","v":1},{"$f":"'23'!X8","v":0},{"$f":"SUM(R8:X8)","v":3},{"$f":"SUM(O8:X8)","v":8},{"$f":"N8+Z8","v":10},{"$f":"AA8-83","v":-73},1]
[null,"  CDJE 87",{"$f":"'87'!C12","v":1},{"$f":"'87'!D12","v":2},{"$f":"'87'!E12","v":4},{"$f":"'87'!F12","v":0},{"$f":"'87'!G12","v":5},{"$f":"'87'!H12","v":2},{"$f":"'87'!I12","v":2},{"$f":"'87'!J12","v":6},{"$f":"'87'!K12","v":15},{"$f":"'87'!L12","v":3},33,40,{"$f":"'87'!O12","v":11},{"$f":"'87'!P12","v":27},{"$f":"'87'!Q12","v":40},{"$f":"'87'!R12","v":4},{"$f":"'87'!S12","v":10},{"$f":"'87'!T12","v":12},{"$f":"'87'!U12","v":21},{"$f":"'87'!V12","v":27},{"$f":"'87'!W12","v":28},{"$f":"'87'!X12","v":12},114,192,232,{"$f":"AA9-233","v":-1},4]
[null," TOTAUX LIMOUSIN",{"$f":"SUM(C7:C9)","v":5},6,9,0,7,7,23,29,21,7,94,114,23,49,64,8,14,36,70,104,56,35,323,459,573,-97,{"$f":"SUM(AC7:AC9)","v":12}]
[]
[null,"(T= total; V= vétéran; S= sénior; J= junior; C= cadet; M= minime; B= benjamin; Po= poussin; Pp= petit poussin; F= féminin; M= masculin )",null,null,null,null,null,null,null,null,null,null,null,null,null,null,null,null,null,"Au 31 août 2018"]

{"sheet":"TOTAL GÉNÉRAL","index":15,"n_rows":11,"n_cols":29,"rows_kept":11,"cut":false,"hidden":false,"merged":[[3,28,4,28],[1,1,2,28],[10,1,10,15],[10,19,10,22],[3,1,4,1],[3,13,4,13],[3,25,4,25],[3,26,4,26],[3,27,4,27]]}
[]
[null,"TOTAL  GÉNÉRAL   2017 - 2018"]
[]
[null,"CDJE","S65","S50",null,"U20","U18","U16","U14","U12","U10","U8","Total","TF","S65","S50",null,"U20","U18","U16","U14","U12","U10","U8","Total","TM ","TOTAL","Écarts","Nb de clubs"]
[null,null,"VF","SF+","SF","JF","CF","MF","BF","PuF","PoF","PpF","Jeunes F",null,"VM","SM+","SM","JM","CM","MM","BM","PuM","PoM","PpM","Jeunes M"]
[null,"  AQUITAINE",{"$f":"'TOTAUX AQ'!C11","v":31},{"$f":"'TOTAUX AQ'!D11","v":40},{"$f":"'TOTAUX AQ'!E11","v":52},{"$f":"'TOTAUX AQ'!F11","v":5},{"$f":"'TOTAUX AQ'!G11","v":8},{"$f":"'TOTAUX AQ'!H11","v":14},{"$f":"'TOTAUX AQ'!I11","v":64},{"$f":"'TOTAUX AQ'!J11","v":93},{"$f":"'TOTAUX AQ'!K11","v":114},{"$f":"'TOTAUX AQ'!L11","v":85},{"$f":"SUM(F6:L6)","v":383},{"$f":"SUM(C6:L6)","v":506},{"$f":"'TOTAUX AQ'!O11","v":173},{"$f":"'TOTAUX AQ'!P11","v":212},{"$f":"'TOTAUX AQ'!Q11","v":309},{"$f":"'TOTAUX AQ'!R11","v":16},{"$f":"'TOTAUX AQ'!S11","v":59},{"$f":"'TOTAUX AQ'!T11","v":110},{"$f":"'TOTAUX AQ'!U11","v":184},{"$f":"'TOTAUX AQ'!V11","v":347},{"$f":"'TOTAUX AQ'!W11","v":419},{"$f":"'TOTAUX AQ'!X11","v":245},{"$f":"SUM(R6:X6)","v":1380},{"$f":"SUM(O6:X6)","v":2074},{"$f":"N6+Z6","v":2580},{"$f":"AA6-2691","v":-111},{"$f":"'TOTAUX AQ'!AC11","v":34}]
[null,"  CHARENTES-POITOU",{"$f":"'TOTAUX CP'!C11","v":8},{"$f":"'TOTAUX CP'!D11","v":9},{"$f":"'TOTAUX CP'!E11","v":17},{"$f":"'TOTAUX CP'!F11","v":1},{"$f":"'TOTAUX CP'!G11","v":1},{"$f":"'TOTAUX CP'!H11","v":8},{"$f":"'TOTAUX CP'!I11","v":9},{"$f":"'TOTAUX CP'!J11","v":22},{"$f":"'TOTAUX CP'!K11","v":39},{"$f":"'TOTAUX CP'!L11","v":15},{"$f":"SUM(F7:L7)","v":95},{"$f":"SUM(C7:L7)","v":129},{"$f":"'TOTAUX CP'!O11","v":52},{"$f":"'TOTAUX CP'!P11","v":103},{"$f":"'TOTAUX CP'!Q11","v":129},{"$f":"'TOTAUX CP'!R11","v":5},{"$f":"'TOTAUX CP'!S11","v":22},{"$f":"'TOTAUX CP'!T11","v":30},{"$f":"'TOTAUX CP'!U11","v":50},{"$f":"'TOTAUX CP'!V11","v":117},{"$f":"'TOTAUX CP'!W11","v":133},{"$f":"'TOTAUX CP'!X11","v":54},{"$f":"SUM(R7:X7)","v":411},{"$f":"SUM(O7:X7)","v":695},{"$f":"N7+Z7","v":824},{"$f":"AA7-785","v":39},{"$f":"'TOTAUX CP'!AC11","v":19}]
[null,"  LIMOUSIN",{"$f":"'TOTAUX LIM'!C10","v":5},{"$f":"'TOTAUX LIM'!D10","v":6},{"$f":"'TOTAUX LIM'!E10","v":9},{"$f":"'TOTAUX LIM'!F10","v":0},{"$f":"'TOTAUX LIM'!G10","v":7},{"$f":"'TOTAUX LIM'!H10","v":7},{"$f":"'TOTAUX LIM'!I10","v":23},{"$f":"'TOTAUX LIM'!J10","v":29},{"$f":"'TOTAUX LIM'!K10","v":21},{"$f":"'TOTAUX LIM'!L10","v":7},94,114,{"$f":"'TOTAUX LIM'!O10","v":23},{"$f":"'TOTAUX LIM'!P10","v":49},{"$f":"'TOTAUX LIM'!Q10","v":64},{"$f":"'TOTAUX LIM'!R10","v":8},{"$f":"'TOTAUX LIM'!S10","v":14},{"$f":"'TOTAUX LIM'!T10","v":36},{"$f":"'TOTAUX LIM'!U10","v":70},{"$f":"'TOTAUX LIM'!V10","v":104},{"$f":"'TOTAUX LIM'!W10","v":56},{"$f":"'TOTAUX LIM'!X10","v":35},323,459,573,{"$f":"AA8-670","v":-97},{"$f":"'TOTAUX LIM'!AC10","v":12}]
[null," NOUVELLE AQUITAINE",{"$f":"SUM(C6:C8)","v":44},55,78,6,16,{"$f":"SUM(H6:H8)","v":29},96,144,174,107,572,749,248,364,502,29,95,176,304,568,608,334,2114,3228,3977,-169,{"$f":"SUM(AC6:AC8)","v":65}]
[]
[null,"(T= total; V= vétéran; S= sénior; J= junior; C= cadet; M= minime; B= benjamin; Po= poussin; Pp= petit poussin; F= féminin; M= masculin )",null,null,null,null,null,null,null,null,null,null,null,null,null,null,null,null,null,"Au 31 août 2018"]

{"sheet":"Évolutions Ligue","index":16,"n_rows":18,"n_cols":9,"rows_kept":18,"cut":false,"hidden":false,"merged":[[19,1,19,3],[1,1,2,8],[3,1,3,8]]}
[]
[null,"ÉVOLUTIONS  LIGUE "]
[]
[null,{"$f":"IF(C4=D4,\"\",\"A REVOIR\")","v":""}]
[null,"CDJE","2015-2016","2016-2017","2017-2018","Var.","2018-2019","Var.","2019-2020"]
[null,"  CDJE 24",156,174,{"$f":"'24'!AA11","v":118},{"$f":"E6-D6","v":-56},"Voir ",null,"Voir "]
[null,"  CDJE 33",1261,1428,{"$f":"'33'!AA19","v":1453},25]
[null,"  CDJE 40",280,317,{"$f":"'40'!AA10","v":289},-28,"en",null,"en"]
[null,"  CDJE 47",205,215,{"$f":"'47'!AA10","v":228},13]
[null,"  CDJE 64",533,557,{"$f":"'64'!AA14","v":492},-65,"août 2019",null,"août 2020"]
[null,"  CDJE 16",194,201,{"$f":"'16'!AA13","v":222},21]
[null,"  CDJE 17",288,298,{"$f":"'17'!AA12","v":330},32]
[null,"  CDJE 79",157,161,{"$f":"'79'!AA11","v":163},2]
[null,"  CDJE 86",134,125,{"$f":"'86'!AA11","v":109},-16]
[null,"  CDJE 19",310,354,{"$f":"'19'!AA14","v":331},-23]
[null,"  CDJE 23",77,83,{"$f":"'23'!AA8","v":10},-73]
[null,"  CDJE 87",252,233,{"$f":"'87'!AA12","v":232},-1]
[null," TOTAUX ",{"$f":"SUM(C6:C17)","v":3847},{"$f":"SUM(D6:D17)","v":4146},{"$f":"SUM(E6:E17)","v":3977},-169]

{"sheet":"Graphique aquitaine","index":17,"n_rows":36,"n_cols":7,"rows_kept":36,"cut":false,"hidden":false,"merged":[[1,2,1,6],[35,2,35,7]]}
[]
[null,null,"É V O L U T I O N   D E S   L I C E N C E S   E N   A Q U I T A I N E"]
[]
[null,null,"Années","Licences A ","Licences B ","Licences A & B","(Total réel)"]
[null,null,"2008-2009",935,908,1842,{"$f":"D5+E5","v":1843}]
[null,null,"2009-2010",937,1090,2027,2027]
[null,null,"2010-2011",924,1234,2158,2158]
[null,null,"2011-2012",993,1445,2458,2438]
[null,null,"2012-2013 ",1116,1471,2584,2587]
[null,null,"2013-2014",1108,1598,2706,2706]
[null,null,"2014-2015 ",1099,1499,2598,2598]
[null,null,"2015-2016 ",1141,1294,2435,2435]
[null,null,"2016-2017",1185,1506,2691,2691]
[null,null,"2017-2018",{"$f":"'Feuille des licences'!E77","v":1176},{"$f":"'Feuille des licences'!F77","v":1393},{"$f":"SUM(D14:E14)","v":2569}]
[null,null,"2018-2019",null,null,{"$f":"SUM(D15:E15)","v":0}]
[]
[]
[]
[]
[]
[]
[]
[]
[]
[]
[]
[]
[]
[]
[]
[]
[]
[]
[]
[]
[null,null,"Nota : un gros écart apparaît entre les licences A & B et la somme des licences A et B réelle (1312 pour 2027) en 2010"]

{"sheet":"Graphique LNAE","index":18,"n_rows":8,"n_cols":10,"rows_kept":8,"cut":false,"hidden":false,"merged":[[1,6,1,9]]}
[]
[null,null,null,null,null,null,"É V O L U T I O N   D E S   L I C E N C E S   E N   N O U V E L L E   A Q U I T A I N E"]
[]
[null,null,null,null,null,null,"Années","Licences A ","Licences B ","Licences A & B"]
[null,null,null,null,null,null,"2015-2016 ",1834,2013,3847]
[null,null,null,null,null,null,"2016-2017",1875,2271,4146]
[null,null,null,null,null,null,"2017-2018",{"$f":"'Feuille des licences'!E74","v":1858},{"$f":"'Feuille des licences'!F74","v":2119},{"$f":"SUM(H7:I7)","v":3977}]
[null,null,null,null,null,null,"2018-2019",null,null,{"$f":"SUM(H8:I8)","v":0}]

{"sheet":"STATISTIQUES LNAE","index":19,"n_rows":74,"n_cols":32,"rows_kept":74,"cut":false,"hidden":false,"merged":[[73,2,73,3],[2,2,2,31],[0,14,0,16],[76,4,77,31]]}
[]
[]
[null,null,"STATISTIQUES  de la LIGUE  NOUVELLE AQUITAINE saison 2017 - 2018"]
[]
[]
[]
[null,null,"Rang","Nom du club","VF","SF+","SF","JF","CF","MF","BF","PuF","PoF","PpF","TjF","TF","VM","SM+","SM","JM","CM","MM","BM","PuM","PoM","PpM","TjM","TM","TOTAL","Lic. A","Lic. B","Lic. A+B"]
[null,null,1," Cercle d'Echecs Cyrano ",1,0,0,0,0,0,0,0,0,1,1,2,9,5,5,0,0,0,1,0,1,0,2,21,23,18,5,{"$f":"AD8+AE8","v":23}]
[null,null,2," Le Fleix - La Tour Infernale (F.E.P.) ",0,0,1,0,0,0,0,0,0,0,0,1,7,4,4,0,0,0,0,0,0,0,0,15,16,13,3,{"$f":"AD9+AE9","v":16}]
[null,null,3," Echiquier du Nontronnais ",0,4,1,0,0,0,2,2,1,0,5,10,3,9,9,0,1,0,1,6,1,2,11,32,42,15,27,42]
[null,null,4," Echiquier Salignacois ",0,0,0,0,0,1,1,2,1,1,6,6,0,1,3,0,2,9,3,5,4,0,23,27,33,6,27,33]
[null,null,5," L'Echiquier de Saint Sour ",0,1,0,0,0,0,0,0,0,1,1,2,0,0,1,0,0,0,1,0,0,0,1,2,4,4,0,4]
[null,null,6," AGJA-Echiquier Aquitaine ",2,3,4,2,2,1,1,1,5,4,16,25,16,9,19,4,2,3,10,14,17,9,59,103,128,96,32,128]
[null,null,7," Bordeaux ASPOM Echecs ",1,1,0,1,0,3,7,7,8,5,31,33,7,17,28,1,0,5,12,8,18,13,57,109,142,84,58,142]
[null,null,8," Union Saint Bruno-Bordeaux Echecs ",0,1,1,0,1,1,1,6,14,5,28,30,0,7,10,0,4,4,3,9,34,11,65,82,112,46,66,112]
[null,null,9," Echiquier Bordelais ",1,3,1,1,2,0,0,5,12,18,38,43,13,19,46,5,7,8,11,46,61,46,184,262,305,149,156,305]
[null,null,10," Echiquier Albert Le Grand ",0,1,3,0,0,4,8,27,22,19,80,84,0,1,7,1,5,16,19,60,72,30,203,211,295,93,202,295]
[null,null,11," Echiquier Club Créonnais ",1,1,4,0,0,0,3,4,5,2,14,20,9,11,8,0,1,1,8,10,11,9,40,68,88,54,34,88]
[null,null,12," Gujan-Mestras Echecs ",0,0,2,0,0,0,2,0,0,1,3,5,10,11,10,0,1,4,2,4,6,4,21,52,57,30,27,57]
[null,null,13," Echecs Club Réolais",0,0,0,0,0,0,0,0,0,0,0,0,1,2,3,0,0,1,3,0,1,1,6,12,12,5,7,12]
[null,null,14," Echiquier Médocain ",1,3,3,0,0,0,1,0,0,0,1,8,2,7,13,0,4,1,2,4,3,0,14,36,44,39,5,44]
[null,null,15," Echiquier Libournais ",3,2,2,0,0,1,10,8,8,1,28,35,6,5,6,0,4,8,17,21,18,8,76,93,128,31,97,128]
[null,null,16," Merignac Echecs ",0,0,1,0,0,0,0,0,0,0,0,1,2,4,2,0,0,0,0,0,0,0,0,8,9,9,0,9]
[null,null,17," Parempuyre Echecs ",0,1,1,1,0,2,0,1,0,1,5,7,2,5,4,1,6,1,4,1,0,1,14,25,32,18,14,32]
[null,null,18," Echiquier Tressois ",0,0,0,0,0,0,2,3,2,3,10,10,6,10,16,1,2,8,8,17,14,9,59,91,101,47,54,101]
[null,null,19," Dax Echiquier Dacquois ",0,0,0,0,0,0,0,0,1,0,1,1,15,1,2,0,1,0,1,4,2,0,8,26,27,20,7,27]
[null,null,20," Mimizan le Fou Ensable (ASEM) ",1,1,0,0,0,0,0,0,0,0,0,2,4,7,3,0,0,1,0,0,0,0,1,15,17,6,11,17]
[null,null,21," Echiquier Montois ",0,2,4,0,2,0,14,18,11,1,46,52,4,14,11,0,1,12,37,53,27,4,134,163,215,59,156,215]
[null,null,22," Hossegor Echecs ",1,2,1,0,0,0,1,0,0,0,1,5,8,6,5,1,0,1,2,1,1,0,6,25,30,13,17,30]
[null,null,23," Echiquier Agenais ",0,1,8,0,0,0,2,2,6,4,14,23,3,12,26,0,2,6,6,16,20,14,64,105,128,80,48,128]
[null,null,24," Echiquier Marmandais ",1,0,0,0,0,0,0,2,0,0,2,3,2,3,2,0,0,0,1,3,0,0,4,11,14,6,8,14]
[null,null,25," Club des Échecs du Pays de Lauzun",2,3,1,0,0,0,0,0,0,0,0,6,8,3,3,0,1,0,0,1,2,0,4,18,24,13,11,24]
[null,null,26," L'Echiquier Villeneuvois ",0,3,2,0,0,0,1,1,2,2,6,11,2,8,11,0,0,3,4,11,6,6,30,51,62,38,24,62]
[null,null,27," Echiquier Bayonne Adour ",5,2,0,0,0,0,0,0,0,0,0,7,5,6,2,0,4,0,4,0,3,1,12,25,32,17,15,32]
[null,null,28," Aviron Bayonnais Echecs ",1,2,2,0,0,0,1,2,4,7,14,19,4,12,19,1,1,4,0,19,58,45,128,163,182,42,140,182]
[null,null,29," Echecs SICSBT ",1,0,1,0,0,0,0,0,0,0,0,2,1,2,0,0,0,0,2,4,6,1,13,16,18,15,3,18]
[null,null,30," Echiquier Henri IV Pau ",4,2,2,0,1,1,7,2,9,4,24,32,9,6,21,0,8,11,16,24,22,22,103,139,171,59,112,171]
[null,null,31," Pau Sarrailh Echecs ",0,0,0,0,0,0,0,0,0,0,0,0,5,1,4,0,2,0,1,0,1,3,7,17,17,14,3,17]
[null,null,32," Club d'Echecs Pau Berlioz ",3,1,4,0,0,0,0,0,0,2,2,10,8,3,3,1,0,2,3,4,4,1,15,29,39,24,15,39]
[null,null,33," Ecole d'Echecs du Béarn ",0,0,1,0,0,0,0,0,3,3,6,7,0,0,2,0,0,0,1,0,3,4,8,10,17,8,9,17]
[null,null,34," La Tour du Chateau ",2,0,2,0,0,0,0,0,0,0,0,4,2,1,1,0,0,1,1,2,3,1,8,12,16,5,11,16]
[null,null,35," Echiquier Angoumoisin ",1,0,0,0,0,0,0,1,1,1,3,4,0,5,12,0,0,0,0,2,5,5,12,29,33,17,16,33]
[null,null,36," Section échecs amicale laique Barbezilienne ",0,0,0,0,0,0,0,0,1,1,2,2,0,1,0,0,0,0,0,7,10,0,17,18,20,6,14,20]
[null,null,37," Chasseneuil Animation Loisirs et Culture - CALC ",2,1,0,0,0,0,0,0,3,0,3,6,2,0,2,0,0,0,2,7,13,0,22,26,32,14,18,32]
[null,null,38," Club d'Echecs de Cognac ",0,0,0,0,0,0,0,0,0,0,0,0,6,7,4,1,3,0,2,3,5,1,15,32,32,27,5,32]
[null,null,39," Echiquier Couronnais ",0,0,2,0,0,0,1,1,5,0,7,9,3,10,15,0,1,4,1,14,5,1,26,54,63,42,21,63]
[null,null,40," Les Tours Du Montbronnais ",0,0,0,0,0,3,1,1,2,2,9,9,5,4,5,0,0,0,2,5,12,0,19,33,42,20,22,42]
[null,null,41," Aytré - La Rochelle Echecs ",0,0,1,0,0,0,0,0,0,0,0,1,3,14,7,0,1,0,2,0,1,0,4,28,29,29,0,29]
[null,null,42," Club d'Echecs de Marennes-Oleron ",0,1,1,0,0,0,0,0,0,0,0,2,2,7,4,0,1,2,0,2,7,4,16,29,31,16,15,31]
[null,null,43," Echiquier Rochefortais ",0,0,0,0,0,0,2,0,2,0,4,4,2,8,5,0,1,2,3,3,3,2,14,29,33,27,6,33]
[null,null,44," La Tour de Germanicus ",0,2,2,0,0,1,2,12,8,1,24,28,6,11,4,1,2,4,9,25,29,2,72,93,121,35,86,121]
[null,null,45," Echiquier Surgerien ",1,1,3,0,1,1,1,2,10,9,24,29,4,3,9,0,5,4,8,19,18,17,71,87,116,45,71,116]
[null,null,46," Echec et Mat de Bressuire ",1,0,2,0,0,0,0,1,2,1,4,7,0,3,5,0,0,1,0,5,7,3,16,24,31,23,8,31]
[null,null,47," Echiquier Niortais ",0,2,2,0,0,2,1,4,3,0,10,14,3,10,7,1,2,4,9,10,16,10,52,72,86,55,31,86]
[null,null,48," Echiquier St Maixentais ",0,0,0,0,0,0,0,0,0,0,0,0,2,3,9,1,2,0,1,3,0,2,9,23,23,17,6,23]
[null,null,49," Club d'échecs de Thouars ",0,0,1,0,0,1,0,0,1,0,2,3,2,2,7,0,3,1,3,1,0,1,9,20,23,12,11,23]
[null,null,50," Echiquier Poitevin ",3,0,2,0,0,0,0,0,1,0,1,6,5,7,9,0,0,2,6,7,1,5,21,42,48,29,19,48]
[null,null,51," C.E. Chatelleraudais ",0,0,0,0,0,0,0,0,0,0,0,0,2,1,0,0,0,0,1,0,0,1,2,5,5,5,0,5]
[null,null,52," Poitiers-Migne Echecs ",0,1,1,1,0,0,1,0,0,0,2,4,3,1,17,1,1,4,1,3,0,0,10,31,35,33,2,35]
[null,null,53," Rois et Dames des Trois Cites ",0,1,0,0,0,0,0,0,0,0,0,1,2,6,8,0,0,2,0,1,1,0,4,20,21,12,9,21]
[null,null,54," Collège d'Argentat",0,0,0,0,0,1,5,1,0,0,7,7,0,0,1,0,0,2,4,1,0,0,7,8,15,5,10,15]
[null,null,55," Brive Le Cavalier Gaillard ",0,1,1,0,2,1,3,6,2,2,16,18,1,8,8,3,2,10,9,26,10,6,66,83,101,43,58,101]
[null,null,56," Alekhine Brive Chess CE de Brive ",0,0,0,0,0,0,1,0,0,0,1,1,0,0,1,0,0,0,1,0,1,1,3,4,5,5,0,5]
[null,null,57," Cercle d'Echecs d' Egletons ",0,0,0,0,0,1,7,7,0,1,16,16,2,2,0,0,0,6,9,18,3,2,38,42,58,5,53,58]
[null,null,58," Meyssac Echecs ",2,1,0,0,0,0,2,1,1,1,5,8,8,5,3,0,1,2,4,1,2,1,11,27,35,9,26,35]
[null,null,59," Club d'Echecs du Pays de Brive ",0,1,2,0,0,2,3,7,3,0,15,18,1,4,5,0,1,3,20,28,11,13,76,86,104,32,72,104]
[null,null,60," Echiquier Tulliste ",2,0,1,0,0,0,0,1,0,0,1,4,0,0,4,1,0,1,1,2,0,0,5,9,13,10,3,13]
[null,null,61," Creuse-Echecs ",0,1,1,0,0,0,0,0,0,0,0,2,0,3,2,0,0,0,1,1,1,0,3,8,10,5,5,10]
[null,null,62," Couzeix Chess Club (C3) ",0,0,1,0,0,0,0,0,4,1,5,6,1,5,7,0,0,2,4,2,8,1,17,30,36,15,21,36]
[null,null,63," Isle Echecs ",0,0,0,0,0,0,0,0,3,2,5,5,4,4,2,0,0,1,2,2,1,1,7,17,22,13,9,22]
[null,null,64," LEC Echiquier Limousin ",1,2,3,0,5,2,2,5,8,0,22,28,5,17,31,4,10,7,15,23,18,10,87,140,168,70,98,168]
[null,null,65," ASSJ Echecs - Cercle Philidor Saint-Junien ",0,0,0,0,0,0,0,1,0,0,1,1,1,1,0,0,0,2,0,0,1,0,3,5,6,6,0,6]
[]
[null,null,"T O T A U X   L N A E",null,{"$f":"SUM(E8:E72)","v":44},55,78,6,16,29,96,{"$f":"SUM(L8:L72)","v":144},174,107,572,749,248,364,502,29,95,176,304,{"$f":"SUM(X8:X72)","v":568},608,334,2114,3228,3977,1858,2119,3977]

{"sheet":"FEUILLE de SAISIE","index":20,"n_rows":248,"n_cols":26,"rows_kept":248,"cut":false,"hidden":false,"merged":[[247,2,247,17],[245,2,245,22],[4,1,4,2],[181,23,181,25],[138,23,138,25],[136,23,136,25],[140,23,140,25],[142,23,142,25],[183,23,186,25],[218,23,218,25],[5,23,5,25],[7,23,7,25],[9,23,9,25],[13,23,13,25],[15,23,15,25],[18,23,22,25],[24,23,28,25],[30,23,33,25],[35,23,43,25],[46,23,54,25],[80,23,80,25],[82,23,85,25],[88,23,88,25],[90,23,90,25],[92,23,98,25],[90,3,90,21],[92,3,92,21],[56,23,59,25],[61,23,63,25],[65,23,65,25],[68,23,70,25],[72,23,76,25],[78,23,78,25],[100,23,100,25],[103,23,107,25],[109,23,109,25],[113,23,115,25],[100,3,100,21],[103,3,103,21],[109,3,109,21],[111,3,111,21],[113,3,113,21],[111,23,111,25],[118,23,118,25],[120,23,125,25],[127,23,127,25],[129,23,134,25],[146,23,146,25],[118,3,118,21],[120,3,120,21],[127,3,127,21],[129,3,129,21],[136,3,136,21],[138,3,138,21],[140,3,140,21],[142,3,142,21],[146,3,146,21],[163,3,163,21],[165,3,165,21],[167,3,167,21],[169,3,169,21],[175,3,175,21],[148,23,148,25],[150,23,150,25],[152,23,152,25],[154,23,156,25],[158,23,160,25],[148,3,148,21],[150,3,150,21],[152,3,152,21],[154,3,154,21],[158,3,158,21],[188,23,188,25],[190,23,190,25],[193,23,195,25],[197,23,197,25],[199,23,199,25],[163,23,163,25],[165,23,165,25],[167,23,167,25],[169,23,173,25],[175,23,178,25],[201,23,201,25],[205,23,205,25],[207,23,210,25],[212,23,212,25],[214,23,216,25],[220,23,223,25],[207,3,207,21],[212,3,212,21],[214,3,214,21],[218,3,218,21],[220,3,220,21],[228,23,228,25],[230,23,230,25],[232,23,232,25],[234,23,239,25],[225,3,225,21],[228,3,228,21],[230,3,230,21],[232,3,232,21],[234,3,234,21],[241,23,241,25],[246,2,246,25],[2,1,2,25],[5,3,5,20],[7,3,7,21],[9,3,9,21],[13,3,13,21],[15,3,15,21],[18,3,18,21],[24,3,24,21],[30,3,30,21],[35,3,35,21],[46,3,46,21],[56,3,56,21],[61,3,61,21],[65,3,65,21],[68,3,68,21],[72,3,72,21],[78,3,78,21],[80,3,80,21],[82,3,82,21],[88,3,88,21],[225,23,225,25],[241,3,241,21],[181,3,181,21],[183,3,183,21],[188,3,188,21],[190,3,190,21],[193,3,193,21],[197,3,197,21],[199,3,199,21],[201,3,201,21],[205,3,205,21]]}
[]
[]
[null,"FEUILLE de SAISIE"]
[]
[null,"Contrôle",null,"VF","SF+","SF","JF","CF","MF","BF","PuF","PoF","PpF","VM","SM+","SM","JM","CM","MM","BM","PuM","PoM","PpM","Licences A","Licences B","Licences A+B"]
[null,null,null,"1 CERCLE D'ÉCHECS CYRANO ",null,null,null,null,null,null,null,null,null,null,null,null,null,null,null,null,null,null,"AQ 24","1 CYRANO 23"]
[{"$f":"IF(B7<>C7,\"ouille!\",\"BON\")","v":"BON"},{"$f":"Z7","v":23},{"$f":"SUM(D7:W7)","v":23},1,0,0,0,0,0,0,0,0,1,9,5,5,0,0,0,1,0,1,0,18,5,{"$f":"X7+Y7","v":23}]
[null,null,null,"2 LE FLEIX-LA TOUR INFERNALE (ALAC) ",null,null,null,null,null,null,null,null,null,null,null,null,null,null,null,null,null,null,"AQ 24","2 LE FLEIX 16"]
[{"$f":"IF(B9<>C9,\"ouille!\",\"BON\")","v":"BON"},{"$f":"Z9","v":16},{"$f":"SUM(D9:W9)","v":16},0,0,1,0,0,0,0,0,0,0,7,4,4,0,0,0,0,0,0,0,13,3,{"$f":"SUM(X9:Y9)","v":16}]
[null,null,null,"3 ÉCHIQUIER DU NONTRONNAIS ",null,null,null,null,null,null,null,null,null,null,null,null,null,null,null,null,null,null,"AQ 24","3 NONTRON 23"]
[{"$f":"IF(C11<>40,\"Comment? Il n'y a pas 40 adhérents?\",\"Il y a bien 40 adhérents!\")","v":"Il y a bien 40 adhérents!"},null,{"$f":"SUM(D11:W11)","v":40},0,4,0,0,0,0,2,2,0,0,3,9,9,0,1,0,1,6,1,2]
[null,null,{"$f":"SUM(D12:W12)","v":2},0,0,1,0,0,0,0,0,1,0,0,0,0,0,0,0,0,0,0,0]
["BON",42,{"$f":"SUM(D13:W13)","v":42},{"$f":"SUM(D11:D12)","v":0},{"$f":"SUM(E11:E12)","v":4},{"$f":"SUM(F11:F12)","v":1},0,0,0,2,2,1,0,{"$f":"SUM(N11:N12)","v":3},{"$f":"SUM(O11:O12)","v":9},{"$f":"SUM(P11:P12)","v":9},0,1,0,1,6,1,2,15,27,{"$f":"SUM(X13:Y13)","v":42}]
[null,null,null,"4 ÉCHIQUIER SALIGNACOIS ",null,null,null,null,null,null,null,null,null,null,null,null,null,null,null,null,null,null,"AQ 24","4 SALIGNAC 53"]
["BON",{"$f":"Z15","v":33},{"$f":"SUM(D15:W15)","v":33},0,0,0,0,0,1,1,2,1,1,0,1,3,0,2,9,3,5,4,0,6,27,{"$f":"SUM(X15:Y15)","v":33}]
[null,null,null,"5 L'ÉCHIQUIER DE SAINT SOUR ",null,null,null,null,null,null,null,null,null,null,null,null,null,null,null,null,null,null,"AQ 24","5 SAINT SOUR 68"]
["BON",4,{"$f":"SUM(D17:W17)","v":4},0,1,0,0,0,0,0,0,0,1,0,0,1,0,0,0,1,0,0,0,4,0,{"$f":"SUM(X17:Y17)","v":4}]
[null,null,null,"VF","SF+","SF","JF","CF","MF","BF","PuF","PoF","PpF","VM","SM+","SM","JM","CM","MM","BM","PuM","PoM","PpM","Licences A","Licences B","Licences A+B"]
[null,null,null,"6 AGJA - ÉCHIQUIER AQUITAINE ",null,null,null,null,null,null,null,null,null,null,null,null,null,null,null,null,null,null,"AQ 33","6 AGJA 136"]
[{"$f":"IF(C20<>40,\"Comment? Il n'y a pas 40 adhérents?\",\"Il y a bien 40 adhérents!\")","v":"Il y a bien 40 adhérents!"},null,{"$f":"SUM(D20:W20)","v":40},1,1,2,0,0,1,1,1,1,1,3,1,3,0,1,0,3,6,10,4]
[{"$f":"IF(C21<>40,\"Comment? Il n'y a pas 40 adhérents?\",\"Il y a bien 40 adhérents!\")","v":"Il y a bien 40 adhérents!"},null,{"$f":"SUM(D21:W21)","v":40},0,1,1,1,2,0,0,0,2,2,6,3,6,3,1,2,3,4,2,1]
[{"$f":"IF(C22<>40,\"Comment? Il n'y a pas 40 adhérents?\",\"Il y a bien 40 adhérents!\")","v":"Il y a bien 40 adhérents!"},null,{"$f":"SUM(D22:W22)","v":40},1,1,1,1,0,0,0,0,2,1,6,4,7,1,0,1,3,3,4,4]
[null,null,{"$f":"SUM(D23:W23)","v":8},0,0,0,0,0,0,0,0,0,0,1,1,3,0,0,0,1,1,1,0]
["BON",{"$f":"Z24","v":128},{"$f":"SUM(D24:W24)","v":128},{"$f":"SUM(D20:D23)","v":2},{"$f":"SUM(E20:E23)","v":3},{"$f":"SUM(F20:F23)","v":4},2,2,1,1,1,5,4,16,9,19,4,2,3,10,14,17,9,96,32,{"$f":"SUM(X24:Y24)","v":128}]
[null,null,null,"7 BORDEAUX ASPOM ÉCHECS ",null,null,null,null,null,null,null,null,null,null,null,null,null,null,null,null,null,null,"AQ 33","7 ASPOM 183"]
[{"$f":"IF(C26<>40,\"Comment? Il n'y a pas 40 adhérents?\",\"Il y a bien 40 adhérents!\")","v":"Il y a bien 40 adhérents!"},null,{"$f":"SUM(D26:W26)","v":40},0,0,0,0,0,0,4,3,2,2,1,5,7,0,0,1,2,4,6,3]
[{"$f":"IF(C27<>40,\"Comment? Il n'y a pas 40 adhérents?\",\"Il y a bien 40 adhérents!\")","v":"Il y a bien 40 adhérents!"},null,{"$f":"SUM(D27:W27)","v":40},0,0,0,1,0,1,3,2,2,1,2,5,7,1,0,2,4,2,3,4]
[{"$f":"IF(C28<>40,\"Comment? Il n'y a pas 40 adhérents?\",\"Il y a bien 40 adhérents!\")","v":"Il y a bien 40 adhérents!"},null,{"$f":"SUM(D28:W28)","v":40},1,0,0,0,0,1,0,1,2,1,2,5,8,0,0,1,6,2,7,3]
[null,null,{"$f":"SUM(D29:W29)","v":22},0,1,0,0,0,1,0,1,2,1,2,2,6,0,0,1,0,0,2,3]
["BON",{"$f":"Z30","v":142},{"$f":"SUM(D30:W30)","v":142},{"$f":"SUM(D26:D29)","v":1},{"$f":"SUM(E26:E29)","v":1},{"$f":"SUM(F26:F29)","v":0},1,0,3,7,7,8,5,7,17,28,1,0,5,12,8,18,13,84,58,{"$f":"SUM(X30:Y30)","v":142}]
[null,null,null,"8 UNION SAINT BRUNO-BORDEAUX ÉCHECS ",null,null,null,null,null,null,null,null,null,null,null,null,null,null,null,null,null,null,"AQ 33","8 USB-BE 116"]
[{"$f":"IF(C32<>40,\"Comment? Il n'y a pas 40 adhérents?\",\"Il y a bien 40 adhérents!\")","v":"Il y a bien 40 adhérents!"},null,{"$f":"SUM(D32:W32)","v":40},0,0,1,0,0,0,0,2,5,1,0,2,1,0,0,2,0,4,13,9]
[{"$f":"IF(C33<>40,\"Comment? Il n'y a pas 40 adhérents?\",\"Il y a bien 40 adhérents!\")","v":"Il y a bien 40 adhérents!"},null,{"$f":"SUM(D33:W33)","v":40},0,1,0,0,1,1,1,1,3,2,0,4,5,0,2,2,3,4,10,0]
[null,null,{"$f":"SUM(D34:W34)","v":32},0,0,0,0,0,0,0,3,6,2,0,1,4,0,2,0,0,1,11,2]
["BON",{"$f":"Z35","v":112},{"$f":"SUM(D35:W35)","v":112},{"$f":"SUM(D32:D34)","v":0},{"$f":"SUM(E32:E34)","v":1},{"$f":"SUM(F32:F34)","v":1},0,1,1,1,6,14,5,0,7,10,0,4,4,3,9,34,11,46,66,{"$f":"SUM(X35:Y35)","v":112}]
[null,null,null,"9 ÉCHIQUIER BORDELAIS ",null,null,null,null,null,null,null,null,null,null,null,null,null,null,null,null,null,null,"AQ 33","9 BORDEAUX 349"]
[{"$f":"IF(C37<>40,\"Comment? Il n'y a pas 40 adhérents?\",\"Il y a bien 40 adhérents!\")","v":"Il y a bien 40 adhérents!"},null,{"$f":"SUM(D37:W37)","v":40},0,0,0,1,0,0,0,1,1,2,1,1,8,2,2,1,3,8,6,3]
[{"$f":"IF(C38<>40,\"Comment? Il n'y a pas 40 adhérents?\",\"Il y a bien 40 adhérents!\")","v":"Il y a bien 40 adhérents!"},null,40,0,0,0,0,0,0,0,1,3,1,2,2,7,0,1,1,0,3,9,10]
[{"$f":"IF(C39<>40,\"Comment? Il n'y a pas 40 adhérents?\",\"Il y a bien 40 adhérents!\")","v":"Il y a bien 40 adhérents!"},null,40,0,0,0,0,2,0,0,2,2,2,1,4,3,0,0,0,2,5,8,9]
["Il y a bien 40 adhérents!",null,40,0,1,0,0,0,0,0,1,1,2,1,3,5,1,0,3,1,4,10,7]
["Il y a bien 40 adhérents!",null,40,0,0,0,0,0,0,0,0,0,4,3,0,6,1,1,0,2,9,6,8]
["Il y a bien 40 adhérents!",null,40,1,0,0,0,0,0,0,0,0,4,1,5,6,0,0,1,2,8,9,3]
[{"$f":"IF(C43<>40,\"Comment? Il n'y a pas 40 adhérents?\",\"Il y a bien 40 adhérents!\")","v":"Il y a bien 40 adhérents!"},null,40,0,1,1,0,0,0,0,0,3,2,3,4,9,0,2,1,0,6,5,3]
[null,null,25,0,1,0,0,0,0,0,0,2,1,1,0,2,1,1,1,1,3,8,3]
["BON",{"$f":"Z45","v":305},305,{"$f":"SUM(D37:D44)","v":1},{"$f":"SUM(E37:E44)","v":3},{"$f":"SUM(F37:F44)","v":1},1,2,0,0,5,12,18,13,19,46,5,7,8,11,46,61,46,149,156,{"$f":"SUM(X45:Y45)","v":305}]
[null,null,null,"VF","SF+","SF","JF","CF","MF","BF","PuF","PoF","PpF","VM","SM+","SM","JM","CM","MM","BM","PuM","PoM","PpM","Licences A","Licences B","Licences A+B"]
[null,null,null," 10 ÉCHIQUIER ALBERT LE GRAND ",null,null,null,null,null,null,null,null,null,null,null,null,null,null,null,null,null,null,"AQ 33"," 10 ALGB 244"]
[{"$f":"IF(C48<>40,\"Comment? Il n'y a pas 40 adhérents?\",\"Il y a bien 40 adhérents!\")","v":"Il y a bien 40 adhérents!"},null,{"$f":"SUM(D48:W48)","v":40},0,0,0,0,0,1,1,3,1,3,0,0,1,1,0,1,2,12,7,7]
[{"$f":"IF(C49<>40,\"Comment? Il n'y a pas 40 adhérents?\",\"Il y a bien 40 adhérents!\")","v":"Il y a bien 40 adhérents!"},null,40,0,0,1,0,0,1,3,2,3,4,0,0,1,0,0,2,2,5,12,4]
["Il y a bien 40 adhérents!",null,40,0,0,1,0,0,0,1,4,7,2,0,0,2,0,2,1,4,5,6,5]
["Il y a bien 40 adhérents!",null,40,0,0,0,0,0,0,2,4,3,1,0,1,0,0,0,4,4,8,10,3]
["Il y a bien 40 adhérents!",null,40,0,0,1,0,0,1,1,6,1,3,0,0,2,0,1,3,3,7,8,3]
["Il y a bien 40 adhérents!",null,40,0,1,0,0,0,0,0,5,3,1,0,0,1,0,1,3,2,7,13,3]
["Il y a bien 40 adhérents!",null,40,0,0,0,0,0,1,0,2,4,3,0,0,0,0,0,2,1,9,14,4]
[null,null,15,0,0,0,0,0,0,0,1,0,2,0,0,0,0,1,0,1,7,2,1]
["BON",{"$f":"Z56","v":295},295,{"$f":"SUM(D48:D55)","v":0},{"$f":"SUM(E48:E55)","v":1},{"$f":"SUM(F48:F55)","v":3},0,0,4,8,27,22,19,0,1,7,1,5,16,19,60,72,30,93,202,{"$f":"SUM(X56:Y56)","v":295}]
[null,null,null,"11 ÉCHIQUIER CLUB CREONNAIS ",null,null,null,null,null,null,null,null,null,null,null,null,null,null,null,null,null,null,"AQ 33","11 CREON 50"]
[{"$f":"IF(C58<>40,\"Comment? Il n'y a pas 40 adhérents?\",\"Il y a bien 40 adhérents!\")","v":"Il y a bien 40 adhérents!"},null,{"$f":"SUM(D58:W58)","v":40},1,0,3,0,0,0,0,2,1,0,6,5,4,0,0,1,4,4,3,6]
["Il y a bien 40 adhérents!",null,{"$f":"SUM(D59:W59)","v":40},0,1,1,0,0,0,3,1,2,2,2,6,4,0,1,0,2,5,7,3]
[null,null,{"$f":"SUM(D60:W60)","v":8},0,0,0,0,0,0,0,1,2,0,1,0,0,0,0,0,2,1,1,0]
["BON",{"$f":"Z61","v":88},{"$f":"SUM(D61:W61)","v":88},{"$f":"SUM(D58:D60)","v":1},{"$f":"SUM(E58:E60)","v":1},{"$f":"SUM(F58:F60)","v":4},0,0,0,3,4,5,2,9,11,8,0,1,1,8,10,11,9,54,34,{"$f":"SUM(X61:Y61)","v":88}]
[null,null,null,"12 GUJAN-MESTRAS ÉCHECS ",null,null,null,null,null,null,null,null,null,null,null,null,null,null,null,null,null,null,"AQ 33","12 GUJAN 49"]
[{"$f":"IF(C63<>40,\"Comment? Il n'y a pas 40 adhérents?\",\"Il y a bien 40 adhérents!\")","v":"Il y a bien 40 adhérents!"},null,{"$f":"SUM(D63:W63)","v":40},0,0,1,0,0,0,1,0,0,1,6,9,5,0,1,3,2,3,5,3]
[null,null,{"$f":"SUM(D64:W64)","v":17},0,0,1,0,0,0,1,0,0,0,4,2,5,0,0,1,0,1,1,1]
["BON",{"$f":"Z65","v":57},{"$f":"SUM(D65:W65)","v":57},{"$f":"SUM(D63:D64)","v":0},{"$f":"SUM(E63:E64)","v":0},{"$f":"SUM(F63:F64)","v":2},0,0,0,2,0,0,1,10,11,10,0,1,4,2,4,6,4,30,27,{"$f":"SUM(X65:Y65)","v":57}]
[null,null,null,"13 ÉCHECS CLUB RÉOLAIS ",null,null,null,null,null,null,null,null,null,null,null,null,null,null,null,null,null,null,"AQ 33","13 LA REOLE 13"]
["BON",{"$f":"Z67","v":12},{"$f":"SUM(D67:W67)","v":12},0,0,0,0,0,0,0,0,0,0,1,2,3,0,0,1,3,0,1,1,5,7,{"$f":"SUM(X67:Y67)","v":12}]
[null,null,null,"VF","SF+","SF","JF","CF","MF","BF","PuF","PoF","PpF","VM","SM+","SM","JM","CM","MM","BM","PuM","PoM","PpM","Licences A","Licences B","Licences A+B"]
[null,null,null,"14 ÉCHIQUIER MÉDOCAIN ",null,null,null,null,null,null,null,null,null,null,null,null,null,null,null,null,null,null,"AQ 33","14 MEDOC 41"]
[{"$f":"IF(C70<>40,\"Comment? Il n'y a pas 40 adhérents?\",\"Il y a bien 40 adhérents!\")","v":"Il y a bien 40 adhérents!"},null,{"$f":"SUM(D70:W70)","v":40},1,2,2,0,0,0,1,0,0,0,2,7,13,0,4,1,1,3,3,0]
[null,null,{"$f":"SUM(D71:W71)","v":4},0,1,1,0,0,0,0,0,0,0,0,0,0,0,0,0,1,1,0,0]
["BON",{"$f":"Z72","v":44},{"$f":"SUM(D72:W72)","v":44},{"$f":"SUM(D70:D71)","v":1},{"$f":"SUM(E70:E71)","v":3},{"$f":"SUM(F70:F71)","v":3},0,0,0,1,0,0,0,2,7,13,0,4,1,2,4,3,0,39,5,{"$f":"SUM(X72:Y72)","v":44}]
[null,null,null,"15 ÉCHIQUIER  LIBOURNAIS ",null,null,null,null,null,null,null,null,null,null,null,null,null,null,null,null,null,null,"AQ 33","15 LIBOURNE 118"]
[{"$f":"IF(C74<>40,\"Comment? Il n'y a pas 40 adhérents?\",\"Il y a bien 40 adhérents!\")","v":"Il y a bien 40 adhérents!"},null,{"$f":"SUM(D74:W74)","v":40},1,0,0,0,0,0,5,2,3,1,0,2,3,0,1,1,5,7,9,0]
["Il y a bien 40 adhérents!",null,{"$f":"SUM(D75:W75)","v":40},2,1,0,0,0,0,0,3,3,0,3,2,1,0,1,4,5,8,3,4]
["Il y a bien 40 adhérents!",null,{"$f":"SUM(D76:W76)","v":40},0,1,1,0,0,1,4,2,1,0,2,1,2,0,2,2,7,5,5,4]
[null,null,{"$f":"SUM(D77:W77)","v":8},0,0,1,0,0,0,1,1,1,0,1,0,0,0,0,1,0,1,1,0]
[{"$f":"IF(B78<>C78,\"ouille!\",\"BON\")","v":"BON"},{"$f":"Z78","v":128},{"$f":"SUM(D78:W78)","v":128},{"$f":"SUM(D74:D77)","v":3},{"$f":"SUM(E74:E77)","v":2},{"$f":"SUM(F74:F77)","v":2},0,0,1,10,8,8,1,6,5,6,0,4,8,17,21,18,8,31,97,{"$f":"SUM(X78:Y78)","v":128}]
[null,null,null,"16 MERIGNAC ÉCHECS ",null,null,null,null,null,null,null,null,null,null,null,null,null,null,null,null,null,null,"AQ 33","16 MERIGNAC 19"]
["BON",9,{"$f":"SUM(D80:W80)","v":9},0,0,1,0,0,0,0,0,0,0,2,4,2,0,0,0,0,0,0,0,9,0,{"$f":"SUM(X80:Y80)","v":9}]
[null,null,null," 17 PAREMPUYRE ÉCHECS ",null,null,null,null,null,null,null,null,null,null,null,null,null,null,null,null,null,null,"AQ 33"," 17 PAREMPUYRE 48"]
["BON",{"$f":"Z82","v":32},{"$f":"SUM(D82:W82)","v":32},0,1,1,1,0,2,0,1,0,1,2,5,4,1,6,1,4,1,0,1,18,14,{"$f":"SUM(X82:Y82)","v":32}]
[null,null,null,"18 ÉCHIQUIER TRESSOIS ",null,null,null,null,null,null,null,null,null,null,null,null,null,null,null,null,null,null,"AQ 33","18 TRESSES 62"]
[{"$f":"IF(C84<>40,\"Comment? Il n'y a pas 40 adhérents?\",\"Il y a bien 40 adhérents!\")","v":"Il y a bien 40 adhérents!"},null,{"$f":"SUM(D84:W84)","v":40},0,0,0,0,0,0,1,0,2,2,1,5,9,0,1,2,4,7,4,2]
[{"$f":"IF(C85<>40,\"Comment? Il n'y a pas 40 adhérents?\",\"Il y a bien 40 adhérents!\")","v":"Il y a bien 40 adhérents!"},null,{"$f":"SUM(D85:W85)","v":40},0,0,0,0,0,0,1,2,0,0,2,5,5,1,1,5,1,5,8,4]
[null,null,{"$f":"SUM(D86:W86)","v":21},0,0,0,0,0,0,0,1,0,1,3,0,2,0,0,1,3,5,2,3]
["BON",{"$f":"Z87","v":101},{"$f":"SUM(D87:W87)","v":101},{"$f":"SUM(D84:D86)","v":0},{"$f":"SUM(E84:E86)","v":0},{"$f":"SUM(F84:F86)","v":0},0,0,0,2,3,2,3,6,10,16,1,2,8,8,17,14,9,47,54,{"$f":"SUM(X87:Y87)","v":101}]
[null,null,null,"VF","SF+","SF","JF","CF","MF","BF","PuF","PoF","PpF","VM","SM+","SM","JM","CM","MM","BM","PuM","PoM","PpM","Licences A","Licences B","Licences A+B"]
[null,null,null,"19 DAX ÉCHIQUIER DACQUOIS ",null,null,null,null,null,null,null,null,null,null,null,null,null,null,null,null,null,null,"AQ 40","19 DAX 31"]
["BON",{"$f":"Z90","v":27},{"$f":"SUM(D90:W90)","v":27},0,0,0,0,0,0,0,0,1,0,15,1,2,0,1,0,1,4,2,0,20,7,{"$f":"SUM(X90:Y90)","v":27}]
[null,null,null,"20 MIMIZAN LE FOU ENSABLÉ (ASEM) ",null,null,null,null,null,null,null,null,null,null,null,null,null,null,null,null,null,null,"AQ 40","20 MIMIZAN 11"]
["BON",{"$f":"Z92","v":17},{"$f":"SUM(D92:W92)","v":17},1,1,0,0,0,0,0,0,0,0,4,7,3,0,0,1,0,0,0,0,6,11,{"$f":"SUM(X92:Y92)","v":17}]
[null,null,null,"21 ÉCHIQUIER  MONTOIS ",null,null,null,null,null,null,null,null,null,null,null,null,null,null,null,null,null,null,"AQ 40","21 MONT DE MARSAN 241"]
[{"$f":"IF(C94<>40,\"Comment? Il n'y a pas 40 adhérents?\",\"Il y a bien 40 adhérents!\")","v":"Il y a bien 40 adhérents!"},null,{"$f":"SUM(D94:W94)","v":40},0,0,0,0,0,0,3,4,1,0,1,0,2,0,1,4,5,13,5,1]
["Il y a bien 40 adhérents!",null,40,0,2,0,0,0,0,4,1,2,1,1,3,0,0,0,3,7,12,3,1]
["Il y a bien 40 adhérents!",null,40,0,0,2,0,1,0,2,3,2,0,1,4,4,0,0,1,8,5,7,0]
["Il y a bien 40 adhérents!",null,40,0,0,1,0,0,0,2,4,3,0,1,2,0,0,0,3,10,9,4,1]
["Il y a bien 40 adhérents!",null,40,0,0,0,0,1,0,2,3,3,0,0,4,4,0,0,1,6,10,5,1]
[null,null,15,0,0,1,0,0,0,1,3,0,0,0,1,1,0,0,0,1,4,3,0]
["BON",215,215,{"$f":"SUM(D94:D99)","v":0},{"$f":"SUM(E94:E99)","v":2},{"$f":"SUM(F94:F99)","v":4},0,2,0,14,18,11,1,4,14,11,0,1,12,37,53,27,4,59,156,{"$f":"SUM(X100:Y100)","v":215}]
[null,null,null,"22 HOSSEGOR ÉCHECS ",null,null,null,null,null,null,null,null,null,null,null,null,null,null,null,null,null,null,"AQ 40","22 HOSSEGOR 34"]
["BON",30,{"$f":"SUM(D102:W102)","v":30},1,2,1,0,0,0,1,0,0,0,8,6,5,1,0,1,2,1,1,0,13,17,{"$f":"SUM(X102:Y102)","v":30}]
[null,null,null,"VF","SF+","SF","JF","CF","MF","BF","PuF","PoF","PpF","VM","SM+","SM","JM","CM","MM","BM","PuM","PoM","PpM","Licences A","Licences B","Licences A+B"]
[null,null,null,"23 ÉCHIQUIER  AGENAIS ",null,null,null,null,null,null,null,null,null,null,null,null,null,null,null,null,null,null,"AQ 47","23 AGEN139"]
[{"$f":"IF(C105<>40,\"Comment? Il n'y a pas 40 adhérents?\",\"Il y a bien 40 adhérents!\")","v":"Il y a bien 40 adhérents!"},null,{"$f":"SUM(D105:W105)","v":40},0,1,2,0,0,0,0,0,3,1,1,3,10,0,1,0,1,8,5,4]
[{"$f":"IF(C106<>40,\"Comment? Il n'y a pas 40 adhérents?\",\"Il y a bien 40 adhérents!\")","v":"Il y a bien 40 adhérents!"},null,{"$f":"SUM(D106:W106)","v":40},0,0,4,0,0,0,1,1,0,1,1,3,8,0,1,1,1,3,9,6]
["Il y a bien 40 adhérents!",null,{"$f":"SUM(D107:W107)","v":40},0,0,2,0,0,0,1,1,1,2,1,5,7,0,0,5,4,3,4,4]
[null,null,{"$f":"SUM(D108:W108)","v":8},0,0,0,0,0,0,0,0,2,0,0,1,1,0,0,0,0,2,2,0]
["BON",128,{"$f":"SUM(D109:W109)","v":128},{"$f":"SUM(D105:D108)","v":0},{"$f":"SUM(E105:E108)","v":1},{"$f":"SUM(F105:F108)","v":8},0,0,0,2,2,6,4,3,12,26,0,2,6,6,16,20,14,80,48,{"$f":"SUM(X109:Y109)","v":128}]
[null,null,null,"24 ÉCHIQUIER MARMANDAIS ",null,null,null,null,null,null,null,null,null,null,null,null,null,null,null,null,null,null,"AQ 47","24 MARMANDE 23"]
["BON",14,{"$f":"SUM(D111:W111)","v":14},1,0,0,0,0,0,0,2,0,0,2,3,2,0,0,0,1,3,0,0,6,8,{"$f":"SUM(X111:Y111)","v":14}]
[null,null,null,"25 CLUB DES ÉCHECS DU PAYS DE LAUZUN ",null,null,null,null,null,null,null,null,null,null,null,null,null,null,null,null,null,null,"AQ 47","25 PAYS DE LAUZUN"]
["BON",{"$f":"Z113","v":24},{"$f":"SUM(D113:W113)","v":24},2,3,1,0,0,0,0,0,0,0,8,3,3,0,1,0,0,1,2,0,13,11,{"$f":"SUM(X113:Y113)","v":24}]
[null,null,null,"26 L'ÉCHIQUIER  VILLENEUVOIS ",null,null,null,null,null,null,null,null,null,null,null,null,null,null,null,null,null,null,"AQ 47","26 VILLENEUVE 53"]
[{"$f":"IF(C115<>40,\"Comment? Il n'y a pas 40 adhérents?\",\"Il y a bien 40 adhérents!\")","v":"Il y a bien 40 adhérents!"},null,{"$f":"SUM(D115:W115)","v":40},0,2,2,0,0,0,1,0,0,2,0,6,7,0,0,2,3,8,3,4]
[null,null,{"$f":"SUM(D116:W116)","v":22},0,1,0,0,0,0,0,1,2,0,2,2,4,0,0,1,1,3,3,2]
["BON",62,{"$f":"SUM(D117:W117)","v":62},{"$f":"SUM(D115:D116)","v":0},{"$f":"SUM(E115:E116)","v":3},{"$f":"SUM(F115:F116)","v":2},0,0,0,1,1,2,2,2,8,11,0,0,3,4,11,6,6,38,24,{"$f":"SUM(X117:Y117)","v":62}]
[null,null,null,"VF","SF+","SF","JF","CF","MF","BF","PuF","PoF","PpF","VM","SM+","SM","JM","CM","MM","BM","PuM","PoM","PpM","Licences A","Licences B","Licences A+B"]
[null,null,null,"27 ÉCHIQUIER BAYONNE ADOUR ",null,null,null,null,null,null,null,null,null,null,null,null,null,null,null,null,null,null,"AQ 64","27 BAYONNE 21"]
["BON",{"$f":"Z120","v":32},{"$f":"SUM(D120:W120)","v":32},5,2,0,0,0,0,0,0,0,0,5,6,2,0,4,0,4,0,3,1,17,15,{"$f":"SUM(X120:Y120)","v":32}]
[null,null,null,"28 AVIRON BAYONNAIS",null,null,null,null,null,null,null,null,null,null,null,null,null,null,null,null,null,null,"AQ 64","28 BASQUE 134"]
[{"$f":"IF(C122<>40,\"Comment? Il n'y a pas 40 adhérents?\",\"Il y a bien 40 adhérents!\")","v":"Il y a bien 40 adhérents!"},null,{"$f":"SUM(D122:W122)","v":40},0,0,1,0,0,0,0,0,1,1,0,4,4,1,0,0,0,7,18,3]
["Il y a bien 40 adhérents!",null,40,1,2,0,0,0,0,0,1,1,2,0,2,4,0,0,2,0,1,11,13]
["Il y a bien 40 adhérents!",null,40,0,0,0,0,0,0,0,0,2,3,0,2,2,0,1,0,0,4,11,15]
["Il y a bien 40 adhérents!",null,40,0,0,1,0,0,0,1,1,0,1,1,3,7,0,0,2,0,3,14,6]
[null,null,22,0,0,0,0,0,0,0,0,0,0,3,1,2,0,0,0,0,4,4,8]
["BON",{"$f":"Z127","v":182},182,{"$f":"SUM(D122:D126)","v":1},{"$f":"SUM(E122:E126)","v":2},{"$f":"SUM(F122:F126)","v":2},0,0,0,1,2,4,7,4,12,19,1,1,4,0,19,58,45,42,140,{"$f":"SUM(X127:Y127)","v":182}]
[null,null,null,"29 ÉCHECS SICSBT ",null,null,null,null,null,null,null,null,null,null,null,null,null,null,null,null,null,null,"AQ 64","29 SICSBT 23"]
["BON",{"$f":"Z129","v":18},{"$f":"SUM(D129:W129)","v":18},1,0,1,0,0,0,0,0,0,0,1,2,0,0,0,0,2,4,6,1,15,3,{"$f":"SUM(X129:Y129)","v":18}]
[null,null,null,"30 ÉCHIQUIER HENRI IV PAU ",null,null,null,null,null,null,null,null,null,null,null,null,null,null,null,null,null,null,"AQ 64","30 HENRI IV 251"]
[{"$f":"IF(C131<>40,\"Comment? Il n'y a pas 40 adhérents?\",\"Il y a bien 40 adhérents!\")","v":"Il y a bien 40 adhérents!"},null,{"$f":"SUM(D131:W131)","v":40},0,0,0,0,1,0,0,1,4,2,1,0,3,0,2,3,3,6,6,8]
["Il y a bien 40 adhérents!",null,40,1,0,0,0,0,0,3,0,2,1,3,1,3,0,0,3,5,4,8,6]
["Il y a bien 40 adhérents!",null,40,1,1,1,0,0,0,1,1,1,0,3,1,9,0,5,4,1,5,4,2]
["Il y a bien 40 adhérents!",null,40,2,1,1,0,0,1,3,0,1,1,2,2,5,0,1,1,6,6,3,4]
[null,null,11,0,0,0,0,0,0,0,0,1,0,0,2,1,0,0,0,1,3,1,2]
["BON",171,171,{"$f":"SUM(D131:D135)","v":4},{"$f":"SUM(E131:E135)","v":2},{"$f":"SUM(F131:F135)","v":2},0,1,1,7,2,9,4,9,6,21,0,8,11,16,24,22,22,59,112,{"$f":"SUM(X136:Y136)","v":171}]
[null,null,null,"31 PAU SARRAILH ÉCHECS ",null,null,null,null,null,null,null,null,null,null,null,null,null,null,null,null,null,null,"AQ 64","31 SARRAILH 19"]
["BON",17,{"$f":"SUM(D138:W138)","v":17},0,0,0,0,0,0,0,0,0,0,5,1,4,0,2,0,1,0,1,3,14,3,{"$f":"SUM(X138:Y138)","v":17}]
[null,null,null,"32 CLUB D'ÉCHECS PAU BERLIOZ ",null,null,null,null,null,null,null,null,null,null,null,null,null,null,null,null,null,null,"AQ 64","32 BERLIOZ 45"]
[{"$f":"IF(B140<>C140,\"ouille!\",\"BON\")","v":"BON"},39,{"$f":"SUM(D140:W140)","v":39},3,1,4,0,0,0,0,0,0,2,8,3,3,1,0,2,3,4,4,1,24,15,{"$f":"SUM(X140:Y140)","v":39}]
[null,null,null,"33 ÉCOLE D'ÉCHECS DU BEARN ",null,null,null,null,null,null,null,null,null,null,null,null,null,null,null,null,null,null,"AQ 64","33 BEARN 40"]
["BON",{"$f":"Z142","v":17},{"$f":"SUM(D142:W142)","v":17},0,0,1,0,0,0,0,0,3,3,0,0,2,0,0,0,1,0,3,4,8,9,{"$f":"SUM(X142:Y142)","v":17}]
[null,null,null,"34 LA TOUR DU CHÂTEAU ",null,null,null,null,null,null,null,null,null,null,null,null,null,null,null,null,null,null,"AQ 64","34 LA TOUR 23"]
["BON",{"$f":"Z144","v":16},{"$f":"SUM(D144:W144)","v":16},2,0,2,0,0,0,0,0,0,0,2,1,1,0,0,1,1,2,3,1,5,11,{"$f":"SUM(X144:Y144)","v":16}]
[]
[null,null,null,"VF","SF+","SF","JF","CF","MF","BF","PuF","PoF","PpF","VM","SM+","SM","JM","CM","MM","BM","PuM","PoM","PpM","Licences A","Licences B","Licences A+B"]
[null,null,null,"35 ÉCHIQUIER ANGOUMOISIN ",null,null,null,null,null,null,null,null,null,null,null,null,null,null,null,null,null,null,"CP 16","35 ANGOULEME 24"]
["BON",{"$f":"Z148","v":33},{"$f":"SUM(D148:W148)","v":33},1,0,0,0,0,0,0,1,1,1,0,5,12,0,0,0,0,2,5,5,17,16,{"$f":"SUM(X148:Y148)","v":33}]
[null,null,null,"36 SECTION ÉCHECS AMICALE LAÏQUE BARBEZILIENNE ",null,null,null,null,null,null,null,null,null,null,null,null,null,null,null,null,null,null,"CP 16","36 BARBEZIEUX 33"]
["BON",{"$f":"Z150","v":20},{"$f":"SUM(D150:W150)","v":20},0,0,0,0,0,0,0,0,1,1,0,1,0,0,0,0,0,7,10,0,6,14,{"$f":"SUM(X150:Y150)","v":20}]
[null,null,null,"37 CHASSENEUIL ANIMATION LOISIRS ET CULTURE - CALC ",null,null,null,null,null,null,null,null,null,null,null,null,null,null,null,null,null,null,"CP 16","37 CHASSENEUIL 31"]
["BON",{"$f":"Z152","v":32},{"$f":"SUM(D152:W152)","v":32},2,1,0,0,0,0,0,0,3,0,2,0,2,0,0,0,2,7,13,0,14,18,{"$f":"SUM(X152:Y152)","v":32}]
[null,null,null,"38 CLUB D'ÉCHECS DE COGNAC ",null,null,null,null,null,null,null,null,null,null,null,null,null,null,null,null,null,null,"CP 16","38 COGNAC 25"]
["BON",{"$f":"Z154","v":32},{"$f":"SUM(D154:W154)","v":32},0,0,0,0,0,0,0,0,0,0,6,7,4,1,3,0,2,3,5,1,27,5,{"$f":"SUM(X154:Y154)","v":32}]
[null,null,null,"39 ÉCHIQUIER COURONNAIS ",null,null,null,null,null,null,null,null,null,null,null,null,null,null,null,null,null,null,"CP 16","39 LA COURONNE 47"]
[{"$f":"IF(C156<>40,\"Comment? Il n'y a pas 40 adhérents?\",\"Il y a bien 40 adhérents!\")","v":"Il y a bien 40 adhérents!"},null,{"$f":"SUM(D156:W156)","v":40},0,0,2,0,0,0,1,1,3,0,1,5,9,0,1,1,0,11,4,1]
[null,null,{"$f":"SUM(D157:W157)","v":23},0,0,0,0,0,0,0,0,2,0,2,5,6,0,0,3,1,3,1,0]
["BON",{"$f":"Z158","v":63},{"$f":"SUM(D158:W158)","v":63},{"$f":"SUM(D156:D157)","v":0},{"$f":"SUM(E156:E157)","v":0},{"$f":"SUM(F156:F157)","v":2},0,0,0,1,1,5,0,3,10,15,0,1,4,1,14,5,1,42,21,{"$f":"SUM(X158:Y158)","v":63}]
[null,null,null,"40 LES TOURS DU MONTBRONNAIS ",null,null,null,null,null,null,null,null,null,null,null,null,null,null,null,null,null,null,"CP 16","40 MONTBRON 41"]
[{"$f":"IF(C160<>40,\"Comment? Il n'y a pas 40 adhérents?\",\"Il y a bien 40 adhérents!\")","v":"Il y a bien 40 adhérents!"},null,{"$f":"SUM(D160:W160)","v":40},0,0,0,0,0,3,1,1,2,2,5,4,4,0,0,0,2,5,11,0]
[null,null,{"$f":"SUM(D161:W161)","v":2},0,0,0,0,0,0,0,0,0,0,0,0,1,0,0,0,0,0,1,0]
["BON",{"$f":"Z162","v":42},{"$f":"SUM(D162:W162)","v":42},{"$f":"SUM(D160:D161)","v":0},{"$f":"SUM(E160:E161)","v":0},{"$f":"SUM(F160:F161)","v":0},0,0,3,1,1,2,2,5,4,5,0,0,0,2,5,12,0,20,22,{"$f":"SUM(X162:Y162)","v":42}]
[null,null,null,"VF","SF+","SF","JF","CF","MF","BF","PuF","PoF","PpF","VM","SM+","SM","JM","CM","MM","BM","PuM","PoM","PpM","Licences A","Licences B","Licences A+B"]
[null,null,null,"41 AYTRÉ - LA ROCHELLE ÉCHECS ",null,null,null,null,null,null,null,null,null,null,null,null,null,null,null,null,null,null,"CP 17","41 LA ROCHELLE 27"]
["BON",{"$f":"Z165","v":29},{"$f":"SUM(D165:W165)","v":29},0,0,1,0,0,0,0,0,0,0,3,14,7,0,1,0,2,0,1,0,29,0,{"$f":"SUM(X165:Y165)","v":29}]
[null,null,null,"42 CLUB D'ÉCHECS DE MARENNES-OLERON ",null,null,null,null,null,null,null,null,null,null,null,null,null,null,null,null,null,null,"CP 17","42 OLERON 26"]
["BON",{"$f":"Z167","v":31},{"$f":"SUM(D167:W167)","v":31},0,1,1,0,0,0,0,0,0,0,2,7,4,0,1,2,0,2,7,4,16,15,{"$f":"SUM(X167:Y167)","v":31}]
[null,null,null,"43 ÉCHIQUIER ROCHEFORTAIS ",null,null,null,null,null,null,null,null,null,null,null,null,null,null,null,null,null,null,"CP 17","43 ROCHEFORT 32"]
["BON",{"$f":"Z169","v":33},{"$f":"SUM(D169:W169)","v":33},0,0,0,0,0,0,2,0,2,0,2,8,5,0,1,2,3,3,3,2,27,6,{"$f":"SUM(X169:Y169)","v":33}]
[null,null,null,"44 LA TOUR DE GERMANICUS ",null,null,null,null,null,null,null,null,null,null,null,null,null,null,null,null,null,null,"CP 17","44 GERMANICUS 88"]
[{"$f":"IF(C171<>40,\"Comment? Il n'y a pas 40 adhérents?\",\"Il y a bien 40 adhérents!\")","v":"Il y a bien 40 adhérents!"},null,{"$f":"SUM(D171:W171)","v":40},0,1,0,0,0,0,2,2,3,1,1,3,3,0,0,0,4,7,13,0]
["Il y a bien 40 adhérents!",null,40,0,1,0,0,0,1,0,5,2,0,2,4,1,0,0,4,2,8,10,0]
["Il y a bien 40 adhérents!",null,40,0,0,2,0,0,0,0,5,3,0,3,4,0,1,2,0,3,9,6,2]
[null,null,1,0,0,0,0,0,0,0,0,0,0,0,0,0,0,0,0,0,1,0,0]
["BON",121,121,{"$f":"SUM(D171:D174)","v":0},2,2,0,0,1,2,12,8,1,6,11,4,1,2,4,9,25,29,2,35,86,{"$f":"SUM(X175:Y175)","v":121}]
[null,null,null,"45 ÉCHIQUIER SURGERIEN ",null,null,null,null,null,null,null,null,null,null,null,null,null,null,null,null,null,null,"CP 17","45 SURGERE 112"]
[{"$f":"IF(C177<>40,\"Comment? Il n'y a pas 40 adhérents?\",\"Il y a bien 40 adhérents!\")","v":"Il y a bien 40 adhérents!"},null,{"$f":"SUM(D177:W177)","v":40},0,0,0,0,0,1,1,1,3,4,1,0,6,0,1,1,3,8,6,4]
[{"$f":"IF(C178<>40,\"Comment? Il n'y a pas 40 adhérents?\",\"Il y a bien 40 adhérents!\")","v":"Il y a bien 40 adhérents!"},null,{"$f":"SUM(D178:W178)","v":40},1,0,2,0,0,0,0,1,2,3,2,2,0,0,2,0,4,5,12,4]
[null,null,{"$f":"SUM(D179:W179)","v":36},0,1,1,0,1,0,0,0,5,2,1,1,3,0,2,3,1,6,0,9]
["BON",116,{"$f":"SUM(D180:W180)","v":116},{"$f":"SUM(D177:D179)","v":1},{"$f":"SUM(E177:E179)","v":1},{"$f":"SUM(F177:F179)","v":3},0,1,1,1,2,10,9,4,3,9,0,5,4,8,19,18,17,45,71,{"$f":"SUM(X180:Y180)","v":116}]
[null,null,null,"VF","SF+","SF","JF","CF","MF","BF","PuF","PoF","PpF","VM","SM+","SM","JM","CM","MM","BM","PuM","PoM","PpM","Licences A","Licences B","Licences A+B"]
[null,null,null,"46 ÉCHEC ET MAT DE BRESSUIRE ",null,null,null,null,null,null,null,null,null,null,null,null,null,null,null,null,null,null,"CP 79","46 BRESSUIRE 31"]
["BON",{"$f":"Z183","v":31},{"$f":"SUM(D183:W183)","v":31},1,0,2,0,0,0,0,1,2,1,0,3,5,0,0,1,0,5,7,3,23,8,{"$f":"SUM(X183:Y183)","v":31}]
[null,null,null,"47 ÉCHIQUIER NIORTAIS ",null,null,null,null,null,null,null,null,null,null,null,null,null,null,null,null,null,null,"CP 79","47 NIORT 83"]
[{"$f":"IF(C185<>40,\"Comment? Il n'y a pas 40 adhérents?\",\"Il y a bien 40 adhérents!\")","v":"Il y a bien 40 adhérents!"},null,{"$f":"SUM(D185:W185)","v":40},0,1,2,0,0,1,1,3,1,0,3,3,4,1,1,3,4,2,6,4]
["Il y a bien 40 adhérents!",null,{"$f":"SUM(D186:W186)","v":40},0,1,0,0,0,1,0,1,2,0,0,6,2,0,1,1,4,7,9,5]
[null,null,{"$f":"SUM(D187:W187)","v":6},0,0,0,0,0,0,0,0,0,0,0,1,1,0,0,0,1,1,1,1]
["BON",86,{"$f":"SUM(D188:W188)","v":86},{"$f":"SUM(D185:D187)","v":0},{"$f":"SUM(E185:E187)","v":2},{"$f":"SUM(F185:F187)","v":2},0,0,2,1,4,3,0,3,10,7,1,2,4,9,10,16,10,55,31,{"$f":"SUM(X188:Y188)","v":86}]
[null,null,null,"48 ÉCHIQUIER SAINT MAIXENTAIS ",null,null,null,null,null,null,null,null,null,null,null,null,null,null,null,null,null,null,"CP 79","48 SAINT MAIXENT 23"]
["BON",23,{"$f":"SUM(D190:W190)","v":23},0,0,0,0,0,0,0,0,0,0,2,3,9,1,2,0,1,3,0,2,17,6,{"$f":"SUM(X190:Y190)","v":23}]
[null,null,null,"49 CLUB D'ÉCHECS DE THOUARS ",null,null,null,null,null,null,null,null,null,null,null,null,null,null,null,null,null,null,"CP 79","49 THOUARS 14"]
["BON",23,{"$f":"SUM(D192:W192)","v":23},0,0,1,0,0,1,0,0,1,0,2,2,7,0,3,1,3,1,0,1,12,11,{"$f":"SUM(X192:Y192)","v":23}]
[null,null,null,"VF","SF+","SF","JF","CF","MF","BF","PuF","PoF","PpF","VM","SM+","SM","JM","CM","MM","BM","PuM","PoM","PpM","Licences A","Licences B","Licences A+B"]
[null,null,null,"50 ÉCHIQUIER POITEVIN ",null,null,null,null,null,null,null,null,null,null,null,null,null,null,null,null,null,null,"CP 86","50 POITEVIN 47"]
[{"$f":"IF(C195<>40,\"Comment? Il n'y a pas 40 adhérents?\",\"Il y a bien 40 adhérents!\")","v":"Il y a bien 40 adhérents!"},null,{"$f":"SUM(D195:W195)","v":40},3,0,2,0,0,0,0,0,0,0,5,6,8,0,0,2,5,5,1,3]
[null,null,{"$f":"SUM(D196:W196)","v":8},0,0,0,0,0,0,0,0,1,0,0,1,1,0,0,0,1,2,0,2]
["BON",{"$f":"Z197","v":48},{"$f":"SUM(D197:W197)","v":48},{"$f":"SUM(D195:D196)","v":3},{"$f":"SUM(E195:E196)","v":0},{"$f":"SUM(F195:F196)","v":2},0,0,0,0,0,1,0,5,7,9,0,0,2,6,7,1,5,29,19,{"$f":"SUM(X197:Y197)","v":48}]
[null,null,null,"51 C.E.CHATELLERAUDAIS ",null,null,null,null,null,null,null,null,null,null,null,null,null,null,null,null,null,null,"CP 86","51 CHATELLERAUD 6"]
["BON",5,{"$f":"SUM(D199:W199)","v":5},0,0,0,0,0,0,0,0,0,0,2,1,0,0,0,0,1,0,0,1,5,0,{"$f":"SUM(X199:Y199)","v":5}]
[null,null,null,"52 POITIERS-MIGNE ÉCHECS ",null,null,null,null,null,null,null,null,null,null,null,null,null,null,null,null,null,null,"CP 86","52 POITIERS MIGNE 45"]
["BON",35,{"$f":"SUM(D201:W201)","v":35},0,1,1,1,0,0,1,0,0,0,3,1,17,1,1,4,1,3,0,0,33,2,{"$f":"SUM(X201:Y201)","v":35}]
[null,null,null,"53 ROIS ET DAMES DES TROIS CITÉS ",null,null,null,null,null,null,null,null,null,null,null,null,null,null,null,null,null,null,"CP 86","53 3 CITES 27"]
["BON",21,{"$f":"SUM(D203:W203)","v":21},0,1,0,0,0,0,0,0,0,0,2,6,8,0,0,2,0,1,1,0,12,9,{"$f":"SUM(X203:Y203)","v":21}]
[]
[null,null,null,"VF","SF+","SF","JF","CF","MF","BF","PuF","PoF","PpF","VM","SM+","SM","JM","CM","MM","BM","PuM","PoM","PpM","Licences A","Licences B","Licences A+B"]
[null,null,null,"54 COLLÈGE D'ARGENTAT ",null,null,null,null,null,null,null,null,null,null,null,null,null,null,null,null,null,null,"LIM 19","54 ARGENTAT 19"]
["BON",{"$f":"Z207","v":15},{"$f":"SUM(D207:W207)","v":15},0,0,0,0,0,1,5,1,0,0,0,0,1,0,0,2,4,1,0,0,5,10,{"$f":"SUM(X207:Y207)","v":15}]
[null,null,null,"55 BRIVE LE CAVALIER GAILLARD ",null,null,null,null,null,null,null,null,null,null,null,null,null,null,null,null,null,null,"LIM 19","55 BRIVE GAILLARD 86"]
[{"$f":"IF(C209<>40,\"Comment? Il n'y a pas 40 adhérents?\",\"Il y a bien 40 adhérents!\")","v":"Il y a bien 40 adhérents!"},null,{"$f":"SUM(D209:W209)","v":40},0,1,0,0,1,0,0,2,2,1,0,2,4,2,1,3,3,12,3,3]
["Il y a bien 40 adhérents!",null,{"$f":"SUM(D210:W210)","v":40},0,0,1,0,1,1,1,2,0,0,1,5,3,1,1,4,4,9,4,2]
[null,null,{"$f":"SUM(D211:W211)","v":21},0,0,0,0,0,0,2,2,0,1,0,1,1,0,0,3,2,5,3,1]
[{"$f":"IF(B212<>C212,\"ouille!\",\"BON\")","v":"BON"},{"$f":"Z212","v":101},101,{"$f":"SUM(D209:D211)","v":0},{"$f":"SUM(E209:E211)","v":1},{"$f":"SUM(F209:F211)","v":1},0,2,1,3,6,2,2,1,8,8,3,2,10,9,26,10,6,43,58,{"$f":"SUM(X212:Y212)","v":101}]
[null,null,null,"56 ALEKHINE BRIVE CHESS CE DE BRIVE ",null,null,null,null,null,null,null,null,null,null,null,null,null,null,null,null,null,null,"LIM 19","56 ALEKHINE 5"]
["BON",{"$f":"Z214","v":5},5,0,0,0,0,0,0,1,0,0,0,0,0,1,0,0,0,1,0,1,1,5,0,{"$f":"SUM(X214:Y214)","v":5}]
[null,null,null,"57 CERCLE D'ÉCHECS D'EGLETONS ",null,null,null,null,null,null,null,null,null,null,null,null,null,null,null,null,null,null,"LIM 19","57 EGLETONS 44"]
[{"$f":"IF(C216<>40,\"Comment? Il n'y a pas 40 adhérents?\",\"Il y a bien 40 adhérents!\")","v":"Il y a bien 40 adhérents!"},null,40,0,0,0,0,0,1,6,4,0,0,1,2,0,0,0,5,6,12,1,2]
[null,null,18,0,0,0,0,0,0,1,3,0,1,1,0,0,0,0,1,3,6,2,0]
["BON",{"$f":"Z218","v":58},58,{"$f":"SUM(D216:D217)","v":0},{"$f":"SUM(E216:E217)","v":0},{"$f":"SUM(F216:F217)","v":0},0,0,1,7,7,0,1,2,2,0,0,0,6,9,18,3,2,5,53,{"$f":"SUM(X218:Y218)","v":58}]
[null,null,null,"58 MEYSSAC ÉCHECS ",null,null,null,null,null,null,null,null,null,null,null,null,null,null,null,null,null,null,"LIM 19","58 MEYSSAC 45"]
["BON",{"$f":"Z220","v":35},35,2,1,0,0,0,0,2,1,1,1,8,5,3,0,1,2,4,1,2,1,9,26,{"$f":"SUM(X220:Y220)","v":35}]
[null,null,null,"59 CLUB D'ÉCHECS DU PAYS DE BRIVE ",null,null,null,null,null,null,null,null,null,null,null,null,null,null,null,null,null,null,"LIM 19","59 PAYS DE BRIVE 144"]
[{"$f":"IF(C222<>40,\"Comment? Il n'y a pas 40 adhérents?\",\"Il y a bien 40 adhérents!\")","v":"Il y a bien 40 adhérents!"},null,40,0,0,0,0,0,1,1,2,1,0,0,1,1,0,0,2,8,13,6,4]
["Il y a bien 40 adhérents!",null,40,0,0,1,0,0,1,1,2,1,0,1,1,3,0,1,1,9,8,2,8]
[null,null,24,0,1,1,0,0,0,1,3,1,0,0,2,1,0,0,0,3,7,3,1]
["BON",104,104,{"$f":"SUM(D222:D224)","v":0},{"$f":"SUM(E222:E224)","v":1},{"$f":"SUM(F222:F224)","v":2},0,0,2,3,7,3,0,1,4,5,0,1,3,20,28,11,13,32,72,{"$f":"SUM(X225:Y225)","v":104}]
[null,null,null,"60 ÉCHIQUIER TULLISTE ",null,null,null,null,null,null,null,null,null,null,null,null,null,null,null,null,null,null,"LIM 19","60 TULLE 11"]
["BON",{"$f":"Z227","v":13},13,2,0,1,0,0,0,0,1,0,0,0,0,4,1,0,1,1,2,0,0,10,3,{"$f":"SUM(X227:Y227)","v":13}]
[null,null,null,"VF","SF+","SF","JF","CF","MF","BF","PuF","PoF","PpF","VM","SM+","SM","JM","CM","MM","BM","PuM","PoM","PpM","Licences A","Licences B","Licences A+B"]
[null,null,null," 61 CREUSE-ÉCHECS ",null,null,null,null,null,null,null,null,null,null,null,null,null,null,null,null,null,null,"LIM 23","61 CREUSE 83"]
["BON",10,10,0,1,1,0,0,0,0,0,0,0,0,3,2,0,0,0,1,1,1,0,5,5,{"$f":"SUM(X230:Y230)","v":10}]
[null,null,null,"62 COUZEIX CHESS CLUB (C3) ",null,null,null,null,null,null,null,null,null,null,null,null,null,null,null,null,null,null,"LIM 87","62 COUZEIX 31"]
["BON",{"$f":"Z232","v":36},36,0,0,1,0,0,0,0,0,4,1,1,5,7,0,0,2,4,2,8,1,15,21,{"$f":"SUM(X232:Y232)","v":36}]
[null,null,null,"63 ISLES ÉCHECS ",null,null,null,null,null,null,null,null,null,null,null,null,null,null,null,null,null,null,"LIM 87","63 ISLES 7"]
["BON",{"$f":"Z234","v":22},22,0,0,0,0,0,0,0,0,3,2,4,4,2,0,0,1,2,2,1,1,13,9,{"$f":"SUM(X234:Y234)","v":22}]
[null,null,null,"64 LEC ÉCHIQUIER LIMOUSIN ",null,null,null,null,null,null,null,null,null,null,null,null,null,null,null,null,null,null,"LIM 87","64 LIMOUSIN 188"]
[{"$f":"IF(C236<>40,\"Comment? Il n'y a pas 40 adhérents?\",\"Il y a bien 40 adhérents!\")","v":"Il y a bien 40 adhérents!"},null,40,0,0,0,0,3,0,1,1,1,0,0,5,5,3,0,2,4,9,3,3]
["Il y a bien 40 adhérents!",null,40,0,0,0,0,1,1,1,0,1,0,3,1,6,0,5,2,6,2,6,5]
["Il y a bien 40 adhérents!",null,40,1,1,2,0,0,0,0,1,4,0,2,4,8,1,3,1,3,5,2,2]
["Il y a bien 40 adhérents!",null,40,0,0,1,0,0,1,0,3,1,0,0,7,11,0,2,1,2,6,5,0]
[null,null,8,0,1,0,0,1,0,0,0,1,0,0,0,1,0,0,1,0,1,2,0]
["BON",168,168,{"$f":"SUM(D236:D240)","v":1},{"$f":"SUM(E236:E240)","v":2},{"$f":"SUM(F236:F240)","v":3},0,5,2,2,5,8,0,5,17,31,4,10,7,15,23,18,10,70,98,{"$f":"SUM(X241:Y241)","v":168}]
[null,null,null,"65 ASSJ ÉCHECS - CERCLE PHILIDOR SAINT-JUNIEN ",null,null,null,null,null,null,null,null,null,null,null,null,null,null,null,null,null,null,"LIM 87","65 AS St Junien 7"]
["BON",6,6,0,0,0,0,0,0,0,1,0,0,1,1,0,0,0,2,0,0,1,0,6,0,{"$f":"SUM(X243:Y243)","v":6}]
[null,null,null,"VF","SF+","SF","JF","CF","MF","BF","PuF","PoF","PpF","VM","SM+","SM","JM","CM","MM","BM","PuM","PoM","PpM","Licences A","Licences B","Licences A+B"]
[]
[null,null,"Récupérer les données sur le site de la ligue avec les feuilles de saisie, puis les transcrire sur la grille ci-dessus."]
[null,null,"Toutes les grilles se complèteront automatiquement. Les données de chaque groupe ont des sources différentes. Ce qui permet le contrôle entre les 2 premières rangées de colonnes."]
[null,null,"L'ordre des clubs devra subir un tri par colonne."]

{"sheet":"Feuille des licences","index":21,"n_rows":77,"n_cols":7,"rows_kept":77,"cut":false,"hidden":false,"merged":[[2,2,2,6],[73,2,73,3]]}
[]
[]
[null,null,"FEUILLE  des LICENCES"]
[]
[]
[]
[null,null,"Rang","Nom du club","Lic. A","Lic. B","Lic. A+B"]
[null,null,1," Cercle d'Echecs Cyrano ",{"$f":"'FEUILLE de SAISIE'!X7","v":18},{"$f":"'FEUILLE de SAISIE'!Y7","v":5},{"$f":"SUM(E8:F8)","v":23}]
[null,null,2," Le Fleix - La Tour Infernale (F.E.P.) ",{"$f":"'FEUILLE de SAISIE'!X9","v":13},{"$f":"'FEUILLE de SAISIE'!Y9","v":3},{"$f":"SUM(E9:F9)","v":16}]
[null,null,3," Echiquier du Nontronnais ",{"$f":"'FEUILLE de SAISIE'!X13","v":15},{"$f":"'FEUILLE de SAISIE'!Y13","v":27},42]
[null,null,4," Echiquier Salignacois ",{"$f":"'FEUILLE de SAISIE'!X15","v":6},{"$f":"'FEUILLE de SAISIE'!Y15","v":27},33]
[null,null,5," L'Echiquier de Saint Sour ",{"$f":"'FEUILLE de SAISIE'!X17","v":4},{"$f":"'FEUILLE de SAISIE'!Y17","v":0},4]
[null,null,6," AGJA-Echiquier Aquitaine ",{"$f":"'FEUILLE de SAISIE'!X24","v":96},{"$f":"'FEUILLE de SAISIE'!Y24","v":32},128]
[null,null,7," Bordeaux ASPOM Echecs ",{"$f":"'FEUILLE de SAISIE'!X30","v":84},{"$f":"'FEUILLE de SAISIE'!Y30","v":58},142]
[null,null,8," Union Saint Bruno-Bordeaux Echecs ",{"$f":"'FEUILLE de SAISIE'!X35","v":46},{"$f":"'FEUILLE de SAISIE'!Y35","v":66},112]
[null,null,9," Echiquier Bordelais ",{"$f":"'FEUILLE de SAISIE'!X45","v":149},{"$f":"'FEUILLE de SAISIE'!Y45","v":156},305]
[null,null,10," Echiquier Albert Le Grand ",{"$f":"'FEUILLE de SAISIE'!X56","v":93},{"$f":"'FEUILLE de SAISIE'!Y56","v":202},295]
[null,null,11," Echiquier Club Créonnais ",{"$f":"'FEUILLE de SAISIE'!X61","v":54},{"$f":"'FEUILLE de SAISIE'!Y61","v":34},88]
[null,null,12," Gujan-Mestras Echecs ",{"$f":"'FEUILLE de SAISIE'!X65","v":30},{"$f":"'FEUILLE de SAISIE'!Y65","v":27},57]
[null,null,13," Echecs Club Réolais",{"$f":"'FEUILLE de SAISIE'!X67","v":5},{"$f":"'FEUILLE de SAISIE'!Y67","v":7},12]
[null,null,14," Echiquier Médocain ",{"$f":"'FEUILLE de SAISIE'!X72","v":39},{"$f":"'FEUILLE de SAISIE'!Y72","v":5},44]
[null,null,15," Echiquier Libournais ",{"$f":"'FEUILLE de SAISIE'!X78","v":31},{"$f":"'FEUILLE de SAISIE'!Y78","v":97},128]
[null,null,16," Merignac Echecs ",{"$f":"'FEUILLE de SAISIE'!X80","v":9},{"$f":"'FEUILLE de SAISIE'!Y80","v":0},9]
[null,null,17," Parempuyre Echecs ",{"$f":"'FEUILLE de SAISIE'!X82","v":18},{"$f":"'FEUILLE de SAISIE'!Y82","v":14},32]
[null,null,18," Echiquier Tressois ",{"$f":"'FEUILLE de SAISIE'!X87","v":47},{"$f":"'FEUILLE de SAISIE'!Y87","v":54},101]
[null,null,19," Dax Echiquier Dacquois ",{"$f":"'FEUILLE de SAISIE'!X90","v":20},{"$f":"'FEUILLE de SAISIE'!Y90","v":7},27]
[null,null,20," Mimizan le Fou Ensable (ASEM) ",{"$f":"'FEUILLE de SAISIE'!X92","v":6},{"$f":"'FEUILLE de SAISIE'!Y92","v":11},17]
[null,null,21," Echiquier Montois ",{"$f":"'FEUILLE de SAISIE'!X100","v":59},{"$f":"'FEUILLE de SAISIE'!Y100","v":156},215]
[null,null,22," Hossegor Echecs ",{"$f":"'FEUILLE de SAISIE'!X102","v":13},{"$f":"'FEUILLE de SAISIE'!Y102","v":17},30]
[null,null,23," Echiquier Agenais ",{"$f":"'FEUILLE de SAISIE'!X109","v":80},{"$f":"'FEUILLE de SAISIE'!Y109","v":48},128]
[null,null,24," Echiquier Marmandais ",{"$f":"'FEUILLE de SAISIE'!X111","v":6},{"$f":"'FEUILLE de SAISIE'!Y111","v":8},14]
[null,null,25," Club des Échecs du Pays de Lauzun",{"$f":"'FEUILLE de SAISIE'!X113","v":13},{"$f":"'FEUILLE de SAISIE'!Y113","v":11},24]
[null,null,26," L'Echiquier Villeneuvois ",{"$f":"'FEUILLE de SAISIE'!X117","v":38},{"$f":"'FEUILLE de SAISIE'!Y117","v":24},62]
[null,null,27," Echiquier Bayonne Adour ",{"$f":"'FEUILLE de SAISIE'!X120","v":17},{"$f":"'FEUILLE de SAISIE'!Y120","v":15},32]
[null,null,28," Cote Basque Echecs ",{"$f":"'FEUILLE de SAISIE'!X127","v":42},{"$f":"'FEUILLE de SAISIE'!Y127","v":140},182]
[null,null,29," Echecs SICSBT ",{"$f":"'FEUILLE de SAISIE'!X129","v":15},{"$f":"'FEUILLE de SAISIE'!Y129","v":3},18]
[null,null,30," Echiquier Henri IV Pau ",{"$f":"'FEUILLE de SAISIE'!X136","v":59},{"$f":"'FEUILLE de SAISIE'!Y136","v":112},171]
[null,null,31," Pau Sarrailh Echecs ",{"$f":"'FEUILLE de SAISIE'!X138","v":14},{"$f":"'FEUILLE de SAISIE'!Y138","v":3},17]
[null,null,32," Club d'Echecs Pau Berlioz ",{"$f":"'FEUILLE de SAISIE'!X140","v":24},{"$f":"'FEUILLE de SAISIE'!Y140","v":15},39]
[null,null,33," Ecole d'Echecs du Béarn ",{"$f":"'FEUILLE de SAISIE'!X142","v":8},{"$f":"'FEUILLE de SAISIE'!Y142","v":9},17]
[null,null,34," La Tour du Château ",{"$f":"'FEUILLE de SAISIE'!X144","v":5},{"$f":"'FEUILLE de SAISIE'!Y144","v":11},16]
[null,null,35," Echiquier Angoumoisin ",{"$f":"'FEUILLE de SAISIE'!X148","v":17},{"$f":"'FEUILLE de SAISIE'!Y148","v":16},33]
[null,null,36," Section echecs amicale laique Barbezilienne ",{"$f":"'FEUILLE de SAISIE'!X150","v":6},{"$f":"'FEUILLE de SAISIE'!Y150","v":14},20]
[null,null,37," Chasseneuil Animation Loisirs et Culture - CALC ",{"$f":"'FEUILLE de SAISIE'!X152","v":14},{"$f":"'FEUILLE de SAISIE'!Y152","v":18},32]
[null,null,38," Club d'Echecs de Cognac ",{"$f":"'FEUILLE de SAISIE'!X154","v":27},{"$f":"'FEUILLE de SAISIE'!Y154","v":5},32]
[null,null,39," Echiquier Couronnais ",{"$f":"'FEUILLE de SAISIE'!X158","v":42},{"$f":"'FEUILLE de SAISIE'!Y158","v":21},63]
[null,null,40," Les Tours Du Montbronnais ",{"$f":"'FEUILLE de SAISIE'!X162","v":20},{"$f":"'FEUILLE de SAISIE'!Y162","v":22},42]
[null,null,41," Aytré - La Rochelle Echecs ",{"$f":"'FEUILLE de SAISIE'!X165","v":29},{"$f":"'FEUILLE de SAISIE'!Y165","v":0},29]
[null,null,42," Club d'Echecs de Marennes-Oleron ",{"$f":"'FEUILLE de SAISIE'!X167","v":16},{"$f":"'FEUILLE de SAISIE'!Y167","v":15},31]
[null,null,43," Echiquier Rochefortais ",{"$f":"'FEUILLE de SAISIE'!X169","v":27},{"$f":"'FEUILLE de SAISIE'!Y169","v":6},33]
[null,null,44," La Tour de Germanicus ",{"$f":"'FEUILLE de SAISIE'!X175","v":35},{"$f":"'FEUILLE de SAISIE'!Y175","v":86},121]
[null,null,45," Echiquier Surgerien ",{"$f":"'FEUILLE de SAISIE'!X180","v":45},{"$f":"'FEUILLE de SAISIE'!Y180","v":71},116]
[null,null,46," Echec et Mat de Bressuire ",{"$f":"'FEUILLE de SAISIE'!X183","v":23},{"$f":"'FEUILLE de SAISIE'!Y183","v":8},31]
[null,null,47," Echiquier Niortais ",{"$f":"'FEUILLE de SAISIE'!X188","v":55},{"$f":"'FEUILLE de SAISIE'!Y188","v":31},86]
[null,null,48," Echiquier St Maixentais ",{"$f":"'FEUILLE de SAISIE'!X190","v":17},{"$f":"'FEUILLE de SAISIE'!Y190","v":6},23]
[null,null,49," Club d'échecs de Thouars ",{"$f":"'FEUILLE de SAISIE'!X192","v":12},{"$f":"'FEUILLE de SAISIE'!Y192","v":11},23]
[null,null,50," Echiquier Poitevin ",{"$f":"'FEUILLE de SAISIE'!X197","v":29},{"$f":"'FEUILLE de SAISIE'!Y197","v":19},48]
[null,null,51," C.E. Chatelleraudais ",{"$f":"'FEUILLE de SAISIE'!X199","v":5},{"$f":"'FEUILLE de SAISIE'!Y199","v":0},5]
[null,null,52," Poitiers-Migne Echecs ",{"$f":"'FEUILLE de SAISIE'!X201","v":33},{"$f":"'FEUILLE de SAISIE'!Y201","v":2},35]
[null,null,53," Rois et Dames des Trois Cites ",{"$f":"'FEUILLE de SAISIE'!X203","v":12},{"$f":"'FEUILLE de SAISIE'!Y203","v":9},21]
[null,null,54," Collège d'Argentat",{"$f":"'FEUILLE de SAISIE'!X207","v":5},{"$f":"'FEUILLE de SAISIE'!Y207","v":10},15]
[null,null,55," Brive Le Cavalier Gaillard ",{"$f":"'FEUILLE de SAISIE'!X212","v":43},{"$f":"'FEUILLE de SAISIE'!Y212","v":58},101]
[null,null,56," Alekhine Brive Chess CE de Brive ",{"$f":"'FEUILLE de SAISIE'!X214","v":5},{"$f":"'FEUILLE de SAISIE'!Y214","v":0},5]
[null,null,57," Cercle d'Echecs d' Egletons ",{"$f":"'FEUILLE de SAISIE'!X218","v":5},{"$f":"'FEUILLE de SAISIE'!Y218","v":53},58]
[null,null,58," Meyssac Echecs ",{"$f":"'FEUILLE de SAISIE'!X220","v":9},{"$f":"'FEUILLE de SAISIE'!Y220","v":26},35]
[null,null,59," Club d'Echecs du Pays de Brive ",{"$f":"'FEUILLE de SAISIE'!X225","v":32},{"$f":"'FEUILLE de SAISIE'!Y225","v":72},104]
[null,null,60," Echiquier Tulliste ",{"$f":"'FEUILLE de SAISIE'!X227","v":10},{"$f":"'FEUILLE de SAISIE'!Y227","v":3},13]
[null,null,61," Creuse-Echecs ",{"$f":"'FEUILLE de SAISIE'!X230","v":5},{"$f":"'FEUILLE de SAISIE'!Y230","v":5},10]
[null,null,62," Couzeix Chess Club (C3) ",{"$f":"'FEUILLE de SAISIE'!X232","v":15},{"$f":"'FEUILLE de SAISIE'!Y232","v":21},36]
[null,null,63," Isle Echecs ",{"$f":"'FEUILLE de SAISIE'!X234","v":13},{"$f":"'FEUILLE de SAISIE'!Y234","v":9},22]
[null,null,64," LEC Echiquier Limousin ",{"$f":"'FEUILLE de SAISIE'!X241","v":70},{"$f":"'FEUILLE de SAISIE'!Y241","v":98},168]
[null,null,65," ASSJ Echecs - Cercle Philidor Saint-Junien ",{"$f":"'FEUILLE de SAISIE'!X243","v":6},{"$f":"'FEUILLE de SAISIE'!Y243","v":0},6]
[]
[null,null,"T O T A U X   L N A E",null,{"$f":"SUM(E8:E72)","v":1858},2119,3977]
[]
[]
[null,null,null,"T AQ",{"$f":"SUM(E8:E41)","v":1176},{"$f":"SUM(F7:F40)","v":1393},{"$f":"SUM(G8:G41)","v":2580}]

{"sheet":"STATISTIQUES GÉNÉRALES","index":22,"n_rows":29,"n_cols":5,"rows_kept":29,"cut":false,"hidden":false,"merged":[[2,3,2,4]]}
[]
[]
[null,null,null,"STATISTIQUES GÉNÉRALES  LNAE saison 2017 - 2018"]
[]
[]
[]
[]
[null,null,null,"NOMBRE  D'ADHÉRENTS",{"$f":"'TOTAL GÉNÉRAL'!AA9","v":3977}]
[null,null,null,"NOMBRE DE CLUBS",{"$f":"'TOTAL GÉNÉRAL'!AC9","v":65}]
[null,null,null,"NOMBRE DE CDJE",12]
[null,null,null,"NOMBRE  DE VÉTÉRANS (F+M)",{"$f":"'TOTAL GÉNÉRAL'!C9+'TOTAL GÉNÉRAL'!O9","v":292}]
[null,null,null,"NOMBRE  DE SÉNIORS + (F+M)",{"$f":"'TOTAL GÉNÉRAL'!D9+'TOTAL GÉNÉRAL'!P9","v":419}]
[null,null,null,"NOMBRE  DE SÉNIORS (F+M)",{"$f":"'TOTAL GÉNÉRAL'!E9+'TOTAL GÉNÉRAL'!Q9","v":580}]
[null,null,null,"NOMBRE  DE JUNIORS (F+M)",{"$f":"'TOTAL GÉNÉRAL'!F9+'TOTAL GÉNÉRAL'!R9","v":35}]
[null,null,null,"NOMBRE  DE CADETS (F+M)",{"$f":"'TOTAL GÉNÉRAL'!G9+'TOTAL GÉNÉRAL'!S9","v":111}]
[null,null,null,"NOMBRE  DE MINIMES (F+M)",{"$f":"'TOTAL GÉNÉRAL'!H9+'TOTAL GÉNÉRAL'!T9","v":205}]
[null,null,null,"NOMBRE  DE BENJAMINS (F+M)",{"$f":"'TOTAL GÉNÉRAL'!I9+'TOTAL GÉNÉRAL'!U9","v":400}]
[null,null,null,"NOMBRE  DE PUPILLES (F+M)",{"$f":"'TOTAL GÉNÉRAL'!J9+'TOTAL GÉNÉRAL'!V9","v":712}]
[null,null,null,"NOMBRE  DE POUSSINS (F+M)",{"$f":"'TOTAL GÉNÉRAL'!K9+'TOTAL GÉNÉRAL'!W9","v":782}]
[null,null,null,"NOMBRE  DE PETITS POUSSINS (F+M)",{"$f":"'TOTAL GÉNÉRAL'!L9+'TOTAL GÉNÉRAL'!X9","v":441}]
[null,null,null,"NOMBRE TOTAL D'ARBITRES",144]
[null,null,null,"NOMBRE  D'ARBITRES AF1 ",12]
[null,null,null,"NOMBRE  D'ARBITRES AF2",5]
[null,null,null,"NOMBRE  D'ARBITRES AF3",41]
[null,null,null,"NOMBRE  D'ARBITRES AF4",72]
[null,null,null,"NOMBRE  D'ARBITRES JEUNES (AJ)",14]
[]
[]
[null,null,null,"Au 31 août 2018"]

{"sheet":"Ordre des clubs","index":23,"n_rows":77,"n_cols":18,"rows_kept":77,"cut":false,"hidden":false,"merged":[[76,4,76,12],[2,3,2,17],[75,2,75,7],[1,3,1,17],[3,3,3,17]]}
[null,null,null,null,"Lire en bas de page"]
[]
[null,null,null,"ORDRE DES CLUBS EN FONCTION DU NOMBRE TOTAL DE LICENCES A, B et A+B"]
[]
[]
[]
[null,null,null,"Rang","Nom du club","Licence A",null,null,null,"Rang","Nom du club","Licence B",null,null,null,"Rang","Nom du club","Licence A+B"]
[null,null,null,1," Cercle d'Echecs Cyrano ",{"$f":"'Feuille des licences'!E8","v":18},null,null,null,1," Cercle d'Echecs Cyrano ",{"$f":"'Feuille des licences'!F8","v":5},null,null,null,1," Cercle d'Echecs Cyrano ",{"$f":"'Feuille des licences'!G8","v":23}]
[null,null,null,2," Le Fleix - La Tour Infernale (F.E.P.) ",{"$f":"'Feuille des licences'!E9","v":13},null,null,null,2," Le Fleix - La Tour Infernale (F.E.P.) ",{"$f":"'Feuille des licences'!F9","v":3},null,null,null,2," Le Fleix - La Tour Infernale (F.E.P.) ",{"$f":"'Feuille des licences'!G9","v":16}]
[null,null,null,3," Echiquier du Nontronnais ",{"$f":"'Feuille des licences'!E10","v":15},null,null,null,3," Echiquier du Nontronnais ",{"$f":"'Feuille des licences'!F10","v":27},null,null,null,3," Echiquier du Nontronnais ",{"$f":"'Feuille des licences'!G10","v":42}]
[null,null,null,4," Echiquier Salignacois ",{"$f":"'Feuille des licences'!E11","v":6},null,null,null,4," Echiquier Salignacois ",{"$f":"'Feuille des licences'!F11","v":27},null,null,null,4," Echiquier Salignacois ",{"$f":"'Feuille des licences'!G11","v":33}]
[null,null,null,5," L'Echiquier de Saint Sour ",{"$f":"'Feuille des licences'!E12","v":4},null,null,null,5," L'Echiquier de Saint Sour ",{"$f":"'Feuille des licences'!F12","v":0},null,null,null,5," L'Echiquier de Saint Sour ",{"$f":"'Feuille des licences'!G12","v":4}]
[null,null,null,6," AGJA-Echiquier Aquitaine ",{"$f":"'Feuille des licences'!E13","v":96},null,null,null,6," AGJA-Echiquier Aquitaine ",{"$f":"'Feuille des licences'!F13","v":32},null,null,null,6," AGJA-Echiquier Aquitaine ",{"$f":"'Feuille des licences'!G13","v":128}]
[null,null,null,7," Bordeaux ASPOM Echecs ",{"$f":"'Feuille des licences'!E14","v":84},null,null,null,7," Bordeaux ASPOM Echecs ",{"$f":"'Feuille des licences'!F14","v":58},null,null,null,7," Bordeaux ASPOM Echecs ",{"$f":"'Feuille des licences'!G14","v":142}]
[null,null,null,8," Union Saint Bruno-Bordeaux Echecs ",{"$f":"'Feuille des licences'!E15","v":46},null,null,null,8," Union Saint Bruno-Bordeaux Echecs ",{"$f":"'Feuille des licences'!F15","v":66},null,null,null,8," Union Saint Bruno-Bordeaux Echecs ",{"$f":"'Feuille des licences'!G15","v":112}]
[null,null,null,9," Echiquier Bordelais ",{"$f":"'Feuille des licences'!E16","v":149},null,null,null,9," Echiquier Bordelais ",{"$f":"'Feuille des licences'!F16","v":156},null,null,null,9," Echiquier Bordelais ",{"$f":"'Feuille des licences'!G16","v":305}]
[null,null,null,10," Echiquier Albert Le Grand ",{"$f":"'Feuille des licences'!E17","v":93},null,null,null,10," Echiquier Albert Le Grand ",{"$f":"'Feuille des licences'!F17","v":202},null,null,null,10," Echiquier Albert Le Grand ",{"$f":"'Feuille des licences'!G17","v":295}]
[null,null,null,11," Echiquier Club Créonnais ",{"$f":"'Feuille des licences'!E18","v":54},null,null,null,11," Echiquier Club Créonnais ",{"$f":"'Feuille des licences'!F18","v":34},null,null,null,11," Echiquier Club Créonnais ",{"$f":"'Feuille des licences'!G18","v":88}]
[null,null,null,12," Gujan-Mestras Echecs ",{"$f":"'Feuille des licences'!E19","v":30},null,null,null,12," Gujan-Mestras Echecs ",{"$f":"'Feuille des licences'!F19","v":27},null,null,null,12," Gujan-Mestras Echecs ",{"$f":"'Feuille des licences'!G19","v":57}]
[null,null,null,13," Echecs Club Réolais",{"$f":"'Feuille des licences'!E20","v":5},null,null,null,13," Echecs Club Réolais",{"$f":"'Feuille des licences'!F20","v":7},null,null,null,13," Echecs Club Réolais",{"$f":"'Feuille des licences'!G20","v":12}]
[null,null,null,14," Echiquier Médocain ",{"$f":"'Feuille des licences'!E21","v":39},null,null,null,14," Echiquier Médocain ",{"$f":"'Feuille des licences'!F21","v":5},null,null,null,14," Echiquier Médocain ",{"$f":"'Feuille des licences'!G21","v":44}]
[null,null,null,15," Echiquier Libournais ",{"$f":"'Feuille des licences'!E22","v":31},null,null,null,15," Echiquier Libournais ",{"$f":"'Feuille des licences'!F22","v":97},null,null,null,15," Echiquier Libournais ",{"$f":"'Feuille des licences'!G22","v":128}]
[null,null,null,16," Merignac Echecs ",{"$f":"'Feuille des licences'!E23","v":9},null,null,null,16," Merignac Echecs ",{"$f":"'Feuille des licences'!F23","v":0},null,null,null,16," Merignac Echecs ",{"$f":"'Feuille des licences'!G23","v":9}]
[null,null,null,17," Parempuyre Echecs ",{"$f":"'Feuille des licences'!E24","v":18},null,null,null,17," Parempuyre Echecs ",{"$f":"'Feuille des licences'!F24","v":14},null,null,null,17," Parempuyre Echecs ",{"$f":"'Feuille des licences'!G24","v":32}]
[null,null,null,18," Echiquier Tressois ",{"$f":"'Feuille des licences'!E25","v":47},null,null,null,18," Echiquier Tressois ",{"$f":"'Feuille des licences'!F25","v":54},null,null,null,18," Echiquier Tressois ",{"$f":"'Feuille des licences'!G25","v":101}]
[null,null,null,19," Dax Echiquier Dacquois ",{"$f":"'Feuille des licences'!E26","v":20},null,null,null,19," Dax Echiquier Dacquois ",{"$f":"'Feuille des licences'!F26","v":7},null,null,null,19," Dax Echiquier Dacquois ",{"$f":"'Feuille des licences'!G26","v":27}]
[null,null,null,20," Mimizan le Fou Ensable (ASEM) ",{"$f":"'Feuille des licences'!E27","v":6},null,null,null,20," Mimizan le Fou Ensable (ASEM) ",{"$f":"'Feuille des licences'!F27","v":11},null,null,null,20," Mimizan le Fou Ensable (ASEM) ",{"$f":"'Feuille des licences'!G27","v":17}]
[null,null,null,21," Echiquier Montois ",{"$f":"'Feuille des licences'!E28","v":59},null,null,null,21," Echiquier Montois ",{"$f":"'Feuille des licences'!F28","v":156},null,null,null,21," Echiquier Montois ",{"$f":"'Feuille des licences'!G28","v":215}]
[null,null,null,22," Hossegor Echecs ",{"$f":"'Feuille des licences'!E29","v":13},null,null,null,22," Hossegor Echecs ",{"$f":"'Feuille des licences'!F29","v":17},null,null,null,22," Hossegor Echecs ",{"$f":"'Feuille des licences'!G29","v":30}]
[null,null,null,23," Echiquier Agenais ",{"$f":"'Feuille des licences'!E30","v":80},null,null,null,23," Echiquier Agenais ",{"$f":"'Feuille des licences'!F30","v":48},null,null,null,23," Echiquier Agenais ",{"$f":"'Feuille des licences'!G30","v":128}]
[null,null,null,24," Echiquier Marmandais ",{"$f":"'Feuille des licences'!E31","v":6},null,null,null,24," Echiquier Marmandais ",{"$f":"'Feuille des licences'!F31","v":8},null,null,null,24," Echiquier Marmandais ",{"$f":"'Feuille des licences'!G31","v":14}]
[null,null,null,25," Club des Échecs du Pays de Lauzun",{"$f":"'Feuille des licences'!E32","v":13},null,null,null,25," Club des Échecs du Pays de Lauzun",{"$f":"'Feuille des licences'!F32","v":11},null,null,null,25," Club des Échecs du Pays de Lauzun",{"$f":"'Feuille des licences'!G32","v":24}]
[null,null,null,26," L'Echiquier Villeneuvois ",{"$f":"'Feuille des licences'!E33","v":38},null,null,null,26," L'Echiquier Villeneuvois ",{"$f":"'Feuille des licences'!F33","v":24},null,null,null,26," L'Echiquier Villeneuvois ",{"$f":"'Feuille des licences'!G33","v":62}]
[null,null,null,27," Echiquier Bayonne Adour ",{"$f":"'Feuille des licences'!E34","v":17},null,null,null,27," Echiquier Bayonne Adour ",{"$f":"'Feuille des licences'!F34","v":15},null,null,null,27," Echiquier Bayonne Adour ",{"$f":"'Feuille des licences'!G34","v":32}]
[null,null,null,28," Aviron Bayonnais Echecs ",{"$f":"'Feuille des licences'!E35","v":42},null,null,null,28," Aviron Bayonnais Echecs ",{"$f":"'Feuille des licences'!F35","v":140},null,null,null,28," Aviron Bayonnais Echecs ",{"$f":"'Feuille des licences'!G35","v":182}]
[null,null,null,29," Echecs SICSBT ",{"$f":"'Feuille des licences'!E36","v":15},null,null,null,29," Echecs SICSBT ",{"$f":"'Feuille des licences'!F36","v":3},null,null,null,29," Echecs SICSBT ",{"$f":"'Feuille des licences'!G36","v":18}]
[null,null,null,30," Echiquier Henri IV Pau ",{"$f":"'Feuille des licences'!E37","v":59},null,null,null,30," Echiquier Henri IV Pau ",{"$f":"'Feuille des licences'!F37","v":112},null,null,null,30," Echiquier Henri IV Pau ",{"$f":"'Feuille des licences'!G37","v":171}]
[null,null,null,31," Pau Sarrailh Echecs ",{"$f":"'Feuille des licences'!E38","v":14},null,null,null,31," Pau Sarrailh Echecs ",{"$f":"'Feuille des licences'!F38","v":3},null,null,null,31," Pau Sarrailh Echecs ",{"$f":"'Feuille des licences'!G38","v":17}]
[null,null,null,32," Club d'Echecs Pau Berlioz ",{"$f":"'Feuille des licences'!E39","v":24},null,null,null,32," Club d'Echecs Pau Berlioz ",{"$f":"'Feuille des licences'!F39","v":15},null,null,null,32," Club d'Echecs Pau Berlioz ",{"$f":"'Feuille des licences'!G39","v":39}]
[null,null,null,33," Ecole d'Echecs du Béarn ",{"$f":"'Feuille des licences'!E40","v":8},null,null,null,33," Ecole d'Echecs du Béarn ",{"$f":"'Feuille des licences'!F40","v":9},null,null,null,33," Ecole d'Echecs du Béarn ",{"$f":"'Feuille des licences'!G40","v":17}]
[null,null,null,34," La Tour du Chateau ",{"$f":"'Feuille des licences'!E41","v":5},null,null,null,34," La Tour du Chateau ",{"$f":"'Feuille des licences'!F41","v":11},null,null,null,34," La Tour du Chateau ",{"$f":"'Feuille des licences'!G41","v":16}]
[null,null,null,35," Echiquier Angoumoisin ",{"$f":"'Feuille des licences'!E42","v":17},null,null,null,35," Echiquier Angoumoisin ",{"$f":"'Feuille des licences'!F42","v":16},null,null,null,35," Echiquier Angoumoisin ",{"$f":"'Feuille des licences'!G42","v":33}]
[null,null,null,36," Section echecs amicale laique Barbezilienne ",{"$f":"'Feuille des licences'!E43","v":6},null,null,null,36," Section echecs amicale laique Barbezilienne ",{"$f":"'Feuille des licences'!F43","v":14},null,null,null,36," Section echecs amicale laique Barbezilienne ",{"$f":"'Feuille des licences'!G43","v":20}]
[null,null,null,37," Chasseneuil Animation Loisirs et Culture - CALC ",{"$f":"'Feuille des licences'!E44","v":14},null,null,null,37," Chasseneuil Animation Loisirs et Culture - CALC ",{"$f":"'Feuille des licences'!F44","v":18},null,null,null,37," Chasseneuil Animation Loisirs et Culture - CALC ",{"$f":"'Feuille des licences'!G44","v":32}]
[null,null,null,38," Club d'Echecs de Cognac ",{"$f":"'Feuille des licences'!E45","v":27},null,null,null,38," Club d'Echecs de Cognac ",{"$f":"'Feuille des licences'!F45","v":5},null,null,null,38," Club d'Echecs de Cognac ",{"$f":"'Feuille des licences'!G45","v":32}]
[null,null,null,39," Echiquier Couronnais ",{"$f":"'Feuille des licences'!E46","v":42},null,null,null,39," Echiquier Couronnais ",{"$f":"'Feuille des licences'!F46","v":21},null,null,null,39," Echiquier Couronnais ",{"$f":"'Feuille des licences'!G46","v":63}]
[null,null,null,40," Les Tours Du Montbronnais ",{"$f":"'Feuille des licences'!E47","v":20},null,null,null,40," Les Tours Du Montbronnais ",{"$f":"'Feuille des licences'!F47","v":22},null,null,null,40," Les Tours Du Montbronnais ",{"$f":"'Feuille des licences'!G47","v":42}]
[null,null,null,41," Aytré - La Rochelle Echecs ",{"$f":"'Feuille des licences'!E48","v":29},null,null,null,41," Aytré - La Rochelle Echecs ",{"$f":"'Feuille des licences'!F48","v":0},null,null,null,41," Aytré - La Rochelle Echecs ",{"$f":"'Feuille des licences'!G48","v":29}]
[null,null,null,42," Club d'Echecs de Marennes-Oleron ",{"$f":"'Feuille des licences'!E49","v":16},null,null,null,42," Club d'Echecs de Marennes-Oleron ",{"$f":"'Feuille des licences'!F49","v":15},null,null,null,42," Club d'Echecs de Marennes-Oleron ",{"$f":"'Feuille des licences'!G49","v":31}]
[null,null,null,43," Echiquier Rochefortais ",{"$f":"'Feuille des licences'!E50","v":27},null,null,null,43," Echiquier Rochefortais ",{"$f":"'Feuille des licences'!F50","v":6},null,null,null,43," Echiquier Rochefortais ",{"$f":"'Feuille des licences'!G50","v":33}]
[null,null,null,44," La Tour de Germanicus ",{"$f":"'Feuille des licences'!E51","v":35},null,null,null,44," La Tour de Germanicus ",{"$f":"'Feuille des licences'!F51","v":86},null,null,null,44," La Tour de Germanicus ",{"$f":"'Feuille des licences'!G51","v":121}]
[null,null,null,45," Echiquier Surgerien ",{"$f":"'Feuille des licences'!E52","v":45},null,null,null,45," Echiquier Surgerien ",{"$f":"'Feuille des licences'!F52","v":71},null,null,null,45," Echiquier Surgerien ",{"$f":"'Feuille des licences'!G52","v":116}]
[null,null,null,46," Echec et Mat de Bressuire ",{"$f":"'Feuille des licences'!E53","v":23},null,null,null,46," Echec et Mat de Bressuire ",{"$f":"'Feuille des licences'!F53","v":8},null,null,null,46," Echec et Mat de Bressuire ",{"$f":"'Feuille des licences'!G53","v":31}]
[null,null,null,47," Echiquier Niortais ",{"$f":"'Feuille des licences'!E54","v":55},null,null,null,47," Echiquier Niortais ",{"$f":"'Feuille des licences'!F54","v":31},null,null,null,47," Echiquier Niortais ",{"$f":"'Feuille des licences'!G54","v":86}]
[null,null,null,48," Echiquier St Maixentais ",{"$f":"'Feuille des licences'!E55","v":17},null,null,null,48," Echiquier St Maixentais ",{"$f":"'Feuille des licences'!F55","v":6},null,null,null,48," Echiquier St Maixentais ",{"$f":"'Feuille des licences'!G55","v":23}]
[null,null,null,49," Club d'échecs de Thouars ",{"$f":"'Feuille des licences'!E56","v":12},null,null,null,49," Club d'échecs de Thouars ",{"$f":"'Feuille des licences'!F56","v":11},null,null,null,49," Club d'échecs de Thouars ",{"$f":"'Feuille des licences'!G56","v":23}]
[null,null,null,50," Echiquier Poitevin ",{"$f":"'Feuille des licences'!E57","v":29},null,null,null,50," Echiquier Poitevin ",{"$f":"'Feuille des licences'!F57","v":19},null,null,null,50," Echiquier Poitevin ",{"$f":"'Feuille des licences'!G57","v":48}]
[null,null,null,51," C.E. Chatelleraudais ",{"$f":"'Feuille des licences'!E58","v":5},null,null,null,51," C.E. Chatelleraudais ",{"$f":"'Feuille des licences'!F58","v":0},null,null,null,51," C.E. Chatelleraudais ",{"$f":"'Feuille des licences'!G58","v":5}]
[null,null,null,52," Poitiers-Migne Echecs ",{"$f":"'Feuille des licences'!E59","v":33},null,null,null,52," Poitiers-Migne Echecs ",{"$f":"'Feuille des licences'!F59","v":2},null,null,null,52," Poitiers-Migne Echecs ",{"$f":"'Feuille des licences'!G59","v":35}]
[null,null,null,53," Rois et Dames des Trois Cites ",{"$f":"'Feuille des licences'!E60","v":12},null,null,null,53," Rois et Dames des Trois Cites ",{"$f":"'Feuille des licences'!F60","v":9},null,null,null,53," Rois et Dames des Trois Cites ",{"$f":"'Feuille des licences'!G60","v":21}]
[null,null,null,54," Collège d'Argentat",{"$f":"'Feuille des licences'!E61","v":5},null,null,null,54," Collège d'Argentat",{"$f":"'Feuille des licences'!F61","v":10},null,null,null,54," Collège d'Argentat",{"$f":"'Feuille des licences'!G61","v":15}]
[null,null,null,55," Brive Le Cavalier Gaillard ",{"$f":"'Feuille des licences'!E62","v":43},null,null,null,55," Brive Le Cavalier Gaillard ",{"$f":"'Feuille des licences'!F62","v":58},null,null,null,55," Brive Le Cavalier Gaillard ",{"$f":"'Feuille des licences'!G62","v":101}]
[null,null,null,56," Alekhine Brive Chess CE de Brive ",{"$f":"'Feuille des licences'!E63","v":5},null,null,null,56," Alekhine Brive Chess CE de Brive ",{"$f":"'Feuille des licences'!F63","v":0},null,null,null,56," Alekhine Brive Chess CE de Brive ",{"$f":"'Feuille des licences'!G63","v":5}]
[null,null,null,57," Cercle d'Echecs d' Egletons ",{"$f":"'Feuille des licences'!E64","v":5},null,null,null,57," Cercle d'Echecs d' Egletons ",{"$f":"'Feuille des licences'!F64","v":53},null,null,null,57," Cercle d'Echecs d' Egletons ",{"$f":"'Feuille des licences'!G64","v":58}]
[null,null,null,58," Meyssac Echecs ",{"$f":"'Feuille des licences'!E65","v":9},null,null,null,58," Meyssac Echecs ",{"$f":"'Feuille des licences'!F65","v":26},null,null,null,58," Meyssac Echecs ",{"$f":"'Feuille des licences'!G65","v":35}]
[null,null,null,59," Club d'Echecs du Pays de Brive ",{"$f":"'Feuille des licences'!E66","v":32},null,null,null,59," Club d'Echecs du Pays de Brive ",{"$f":"'Feuille des licences'!F66","v":72},null,null,null,59," Club d'Echecs du Pays de Brive ",{"$f":"'Feuille des licences'!G66","v":104}]
[null,null,null,60," Echiquier Tulliste ",{"$f":"'Feuille des licences'!E67","v":10},null,null,null,60," Echiquier Tulliste ",{"$f":"'Feuille des licences'!F67","v":3},null,null,null,60," Echiquier Tulliste ",{"$f":"'Feuille des licences'!G67","v":13}]
[null,null,null,61," Creuse-Echecs ",{"$f":"'Feuille des licences'!E68","v":5},null,null,null,61," Creuse-Echecs ",{"$f":"'Feuille des licences'!F68","v":5},null,null,null,61," Creuse-Echecs ",{"$f":"'Feuille des licences'!G68","v":10}]
[null,null,null,62," Couzeix Chess Club (C3) ",{"$f":"'Feuille des licences'!E69","v":15},null,null,null,62," Couzeix Chess Club (C3) ",{"$f":"'Feuille des licences'!F69","v":21},null,null,null,62," Couzeix Chess Club (C3) ",{"$f":"'Feuille des licences'!G69","v":36}]
[null,null,null,63," Isle Echecs ",{"$f":"'Feuille des licences'!E70","v":13},null,null,null,63," Isle Echecs ",{"$f":"'Feuille des licences'!F70","v":9},null,null,null,63," Isle Echecs ",{"$f":"'Feuille des licences'!G70","v":22}]
[null,null,null,64," LEC Echiquier Limousin ",{"$f":"'Feuille des licences'!E71","v":70},null,null,null,64," LEC Echiquier Limousin ",{"$f":"'Feuille des licences'!F71","v":98},null,null,null,64," LEC Echiquier Limousin ",{"$f":"'Feuille des licences'!G71","v":168}]
[null,null,null,65," ASSJ Echecs - Cercle Philidor Saint-Junien ",{"$f":"'Feuille des licences'!E72","v":6},null,null,null,65," ASSJ Echecs - Cercle Philidor Saint-Junien ",{"$f":"'Feuille des licences'!F72","v":0},null,null,null,65," ASSJ Echecs - Cercle Philidor Saint-Junien ",{"$f":"'Feuille des licences'!G72","v":6}]
[]
[]
[]
[]
[null,null,null,null,"Chaque colonne devra subir un tri par ordre décroissant"]

{"sheet":"Grille saisie 1","index":24,"n_rows":252,"n_cols":23,"rows_kept":252,"cut":false,"hidden":false,"merged":[[232,1,232,19],[238,1,238,19],[152,1,152,19],[158,1,158,19],[168,1,168,19],[181,1,181,19],[194,1,194,19],[173,1,173,19],[175,1,175,19],[162,1,162,19],[166,1,166,19],[154,1,154,19],[156,1,156,19],[204,1,204,19],[206,1,206,19],[196,1,196,19],[60,1,60,19],[71,1,71,19],[81,1,81,19],[93,1,93,19],[110,1,110,19],[89,1,89,19],[91,1,91,19],[77,1,77,19],[79,1,79,19],[64,1,64,19],[67,1,67,19],[6,1,6,19],[10,1,10,19],[12,1,12,19],[2,1,2,18],[4,1,4,19],[32,1,32,19],[45,1,45,19],[55,1,55,19],[14,1,14,19],[21,1,21,19],[27,1,27,19],[122,1,122,19],[132,1,132,19],[112,1,112,19],[116,1,116,19],[101,1,101,19],[103,1,103,19],[120,1,120,19],[147,1,147,19],[150,1,150,19],[134,1,134,19],[141,1,141,19],[143,1,143,19],[145,1,145,19],[198,1,198,19],[186,1,186,19],[189,1,189,19],[202,1,202,19],[224,1,224,19],[226,1,226,19],[211,1,211,19],[213,1,213,19],[218,1,218,19],[220,1,220,19],[251,1,251,20],[252,1,252,20],[240,1,240,19],[247,1,247,19],[234,1,234,19],[236,1,236,19]]}
[]
[null,"VF","SF+","SF","JF","CF","MF","BF","PuF","PoF","PpF","VM","SM+","SM","JM","CM","MM","BM","PuM","PoM","PpM",null," Largeur de colonne : 4,3"]
[null,"1 CERCLE D'ÉCHECS CYRANO ",null,null,null,null,null,null,null,null,null,null,null,null,null,null,null,null,null,null,"AQ 24",null,"Page 1 : de 2 à 43"]
[null,null,null,null,null,null,null,null,null,null,null,null,null,null,null,null,null,null,null,null,null,null,"Page 2 : de 45 à 87"]
[null,"2 LE FLEIX-LA TOUR INFERNALE (ALAC) ",null,null,null,null,null,null,null,null,null,null,null,null,null,null,null,null,null,null,"AQ 24",null,"Page 3 : de 89 à 130"]
[null,null,null,null,null,null,null,null,null,null,null,null,null,null,null,null,null,null,null,null,null,null,"Page 4 : de 132 à 171"]
[null,"3 ÉCHIQUIER DU NONTRONNAIS ",null,null,null,null,null,null,null,null,null,null,null,null,null,null,null,null,null,null,"AQ 24",null,"Page 5 : de 173 à 209"]
[null,null,null,null,null,null,null,null,null,null,null,null,null,null,null,null,null,null,null,null,null,null,"Page 6 : de 211 à 250"]
[]
[]
[null,"4 ÉCHIQUIER SALIGNACOIS ",null,null,null,null,null,null,null,null,null,null,null,null,null,null,null,null,null,null,"AQ 24"]
[]
[null,"5 L'ÉCHIQUIER DE SAINT SOUR ",null,null,null,null,null,null,null,null,null,null,null,null,null,null,null,null,null,null,"AQ 24"]
[]
[null,"6 AGJA - ÉCHIQUIER AQUITAINE ",null,null,null,null,null,null,null,null,null,null,null,null,null,null,null,null,null,null,"AQ 33"]
[]
[]
[]
[]
[]
[null,"VF","SF+","SF","JF","CF","MF","BF","PuF","PoF","PpF","VM","SM+","SM","JM","CM","MM","BM","PuM","PoM","PpM"]
[null,"7 BORDEAUX ASPOM ÉCHECS ",null,null,null,null,null,null,null,null,null,null,null,null,null,null,null,null,null,null,"AQ 33"]
[]
[]
[]
[]
[]
[null,"8 UNION SAINT BRUNO-BORDEAUX ÉCHECS ",null,null,null,null,null,null,null,null,null,null,null,null,null,null,null,null,null,null,"AQ 33"]
[]
[]
[]
[]
[null,"9 ÉCHIQUIER BORDELAIS ",null,null,null,null,null,null,null,null,null,null,null,null,null,null,null,null,null,null,"AQ 33"]
[]
[]
[]
[]
[]
[]
[]
[]
[]
[null,"VF","SF+","SF","JF","CF","MF","BF","PuF","PoF","PpF","VM","SM+","SM","JM","CM","MM","BM","PuM","PoM","PpM"]
[]
[null,"VF","SF+","SF","JF","CF","MF","BF","PuF","PoF","PpF","VM","SM+","SM","JM","CM","MM","BM","PuM","PoM","PpM"]
[null," 10 ÉCHIQUIER ALBERT LE GRAND ",null,null,null,null,null,null,null,null,null,null,null,null,null,null,null,null,null,null,"AQ 33"]
[]
[]
[]
[]
[]
[]
[]
[]
[]
[null,"11 ÉCHIQUIER CLUB CREONNAIS ",null,null,null,null,null,null,null,null,null,null,null,null,null,null,null,null,null,null,"AQ 33"]
[]
[]
[]
[]
[null,"12 GUJAN-MESTRAS ÉCHECS ",null,null,null,null,null,null,null,null,null,null,null,null,null,null,null,null,null,null,"AQ 33"]
[]
[]
[]
[null,"13 ÉCHECS CLUB RÉOLAIS ",null,null,null,null,null,null,null,null,null,null,null,null,null,null,null,null,null,null,"AQ 33"]
[]
[null,"VF","SF+","SF","JF","CF","MF","BF","PuF","PoF","PpF","VM","SM+","SM","JM","CM","MM","BM","PuM","PoM","PpM"]
[null,"14 ÉCHIQUIER MÉDOCAIN ",null,null,null,null,null,null,null,null,null,null,null,null,null,null,null,null,null,null,"AQ 33"]
[]
[]
[]
[null,"15 ÉCHIQUIER  LIBOURNAIS ",null,null,null,null,null,null,null,null,null,null,null,null,null,null,null,null,null,null,"AQ 33"]
[]
[]
[]
[]
[]
[null,"16 MERIGNAC ÉCHECS ",null,null,null,null,null,null,null,null,null,null,null,null,null,null,null,null,null,null,"AQ 33"]
[]
[null," 17 PAREMPUYRE ÉCHECS ",null,null,null,null,null,null,null,null,null,null,null,null,null,null,null,null,null,null,"AQ 33"]
[]
[null,"18 ÉCHIQUIER TRESSOIS ",null,null,null,null,null,null,null,null,null,null,null,null,null,null,null,null,null,null,"AQ 33"]
[]
[]
[]
[]
[null,"VF","SF+","SF","JF","CF","MF","BF","PuF","PoF","PpF","VM","SM+","SM","JM","CM","MM","BM","PuM","PoM","PpM"]
[]
[null,"VF","SF+","SF","JF","CF","MF","BF","PuF","PoF","PpF","VM","SM+","SM","JM","CM","MM","BM","PuM","PoM","PpM"]
[null,"19 DAX ÉCHIQUIER DACQUOIS ",null,null,null,null,null,null,null,null,null,null,null,null,null,null,null,null,null,null,"AQ 40"]
[]
[null,"20 MIMIZAN LE FOU ENSABLÉ (ASEM) ",null,null,null,null,null,null,null,null,null,null,null,null,null,null,null,null,null,null,"AQ 40"]
[]
[null,"21 ÉCHIQUIER  MONTOIS ",null,null,null,null,null,null,null,null,null,null,null,null,null,null,null,null,null,null,"AQ 40"]
[]
[]
[]
[]
[]
[]
[]
[null,"22 HOSSEGOR ÉCHECS ",null,null,null,null,null,null,null,null,null,null,null,null,null,null,null,null,null,null,"AQ 40"]
[]
[null,"23 ÉCHIQUIER  AGENAIS ",null,null,null,null,null,null,null,null,null,null,null,null,null,null,null,null,null,null,"AQ 47"]
[]
[]
[]
[]
[]
[null,"VF","SF+","SF","JF","CF","MF","BF","PuF","PoF","PpF","VM","SM+","SM","JM","CM","MM","BM","PuM","PoM","PpM"]
[null,"24 ÉCHIQUIER MARMANDAIS ",null,null,null,null,null,null,null,null,null,null,null,null,null,null,null,null,null,null,"AQ 47"]
[]
[null,"25 CLUB DES ÉCHECS DU PAYS DE LAUZUN ",null,null,null,null,null,null,null,null,null,null,null,null,null,null,null,null,null,null,"AQ 47"]
[]
[]
[]
[null,"26 L'ÉCHIQUIER  VILLENEUVOIS ",null,null,null,null,null,null,null,null,null,null,null,null,null,null,null,null,null,null,"AQ 47"]
[]
[]
[]
[null,"27 ÉCHIQUIER BAYONNE ADOUR ",null,null,null,null,null,null,null,null,null,null,null,null,null,null,null,null,null,null,"AQ 64"]
[]
[null,"28 AVIRON BAYONNAIS ÉCHECS "]
[]
[]
[]
[]
[]
[]
[null,"VF","SF+","SF","JF","CF","MF","BF","PuF","PoF","PpF","VM","SM+","SM","JM","CM","MM","BM","PuM","PoM","PpM"]
[]
[null,"VF","SF+","SF","JF","CF","MF","BF","PuF","PoF","PpF","VM","SM+","SM","JM","CM","MM","BM","PuM","PoM","PpM"]
[null,"29 ÉCHECS SICSBT ",null,null,null,null,null,null,null,null,null,null,null,null,null,null,null,null,null,null,"AQ 64"]
[]
[null,"30 ÉCHIQUIER HENRI IV PAU ",null,null,null,null,null,null,null,null,null,null,null,null,null,null,null,null,null,null,"AQ 64"]
[]
[]
[]
[]
[]
[]
[null,"31 PAU SARRAILH ÉCHECS ",null,null,null,null,null,null,null,null,null,null,null,null,null,null,null,null,null,null,"AQ 64"]
[]
[null,"32 CLUB D'ÉCHECS PAU BERLIOZ ",null,null,null,null,null,null,null,null,null,null,null,null,null,null,null,null,null,null,"AQ 64"]
[]
[null,"33 ÉCOLE D'ÉCHECS DU BEARN ",null,null,null,null,null,null,null,null,null,null,null,null,null,null,null,null,null,null,"AQ 64"]
[]
[null,"34 LA TOUR DU CHÂTEAU ",null,null,null,null,null,null,null,null,null,null,null,null,null,null,null,null,null,null,"AQ 64"]
[]
[null,"VF","SF+","SF","JF","CF","MF","BF","PuF","PoF","PpF","VM","SM+","SM","JM","CM","MM","BM","PuM","PoM","PpM"]
[null,"35 ÉCHIQUIER ANGOUMOISIN ",null,null,null,null,null,null,null,null,null,null,null,null,null,null,null,null,null,null,"CP 16"]
[]
[null,"36 SECTION ÉCHECS AMICALE LAÏQUE BARBEZILIENNE ",null,null,null,null,null,null,null,null,null,null,null,null,null,null,null,null,null,null,"CP 16"]
[]
[null,"37 CHASSENEUIL ANIMATION LOISIRS ET CULTURE - CALC ",null,null,null,null,null,null,null,null,null,null,null,null,null,null,null,null,null,null,"CP 16"]
[]
[null,"38 CLUB D'ÉCHECS DE COGNAC "]
[]
[null,"39 ÉCHIQUIER COURONNAIS ",null,null,null,null,null,null,null,null,null,null,null,null,null,null,null,null,null,null,"CP 16"]
[]
[]
[]
[null,"40 LES TOURS DU MONTBRONNAIS ",null,null,null,null,null,null,null,null,null,null,null,null,null,null,null,null,null,null,"CP 16"]
[]
[]
[]
[null,"41 AYTRÉ - LA ROCHELLE ÉCHECS ",null,null,null,null,null,null,null,null,null,null,null,null,null,null,null,null,null,null,"CP 17"]
[]
[null,"42 CLUB D'ÉCHECS DE MARENNES-OLERON ",null,null,null,null,null,null,null,null,null,null,null,null,null,null,null,null,null,null,"CP 17"]
[]
[null,"VF","SF+","SF","JF","CF","MF","BF","PuF","PoF","PpF","VM","SM+","SM","JM","CM","MM","BM","PuM","PoM","PpM"]
[]
[null,"VF","SF+","SF","JF","CF","MF","BF","PuF","PoF","PpF","VM","SM+","SM","JM","CM","MM","BM","PuM","PoM","PpM"]
[null,"43 ÉCHIQUIER ROCHEFORTAIS ",null,null,null,null,null,null,null,null,null,null,null,null,null,null,null,null,null,null,"CP 17"]
[]
[null,"44 LA TOUR DE GERMANICUS ",null,null,null,null,null,null,null,null,null,null,null,null,null,null,null,null,null,null,"CP 17"]
[]
[]
[]
[]
[]
[null,"45 ÉCHIQUIER SURGERIEN ",null,null,null,null,null,null,null,null,null,null,null,null,null,null,null,null,null,null,"CP 17"]
[]
[]
[]
[]
[null,"46 ÉCHEC ET MAT DE BRESSUIRE ",null,null,null,null,null,null,null,null,null,null,null,null,null,null,null,null,null,null,"CP 79"]
[]
[null,"VF","SF+","SF","JF","CF","MF","BF","PuF","PoF","PpF","VM","SM+","SM","JM","CM","MM","BM","PuM","PoM","PpM"]
[null,"47 ÉCHIQUIER NIORTAIS ",null,null,null,null,null,null,null,null,null,null,null,null,null,null,null,null,null,null,"CP 79"]
[]
[]
[]
[]
[null,"48 ÉCHIQUIER SAINT MAIXENTAIS ",null,null,null,null,null,null,null,null,null,null,null,null,null,null,null,null,null,null,"CP 79"]
[]
[null,"49 CLUB D'ÉCHECS DE THOUARS ",null,null,null,null,null,null,null,null,null,null,null,null,null,null,null,null,null,null,"CP 79"]
[]
[null,"50 ÉCHIQUIER POITEVIN ",null,null,null,null,null,null,null,null,null,null,null,null,null,null,null,null,null,null,"CP 86"]
[]
[]
[]
[null,"51 C.E.CHATELLERAUDAIS ",null,null,null,null,null,null,null,null,null,null,null,null,null,null,null,null,null,null,"CP 86"]
[]
[null,"52 POITIERS-MIGNE ÉCHECS ",null,null,null,null,null,null,null,null,null,null,null,null,null,null,null,null,null,null,"CP 86"]
[]
[null,"53 ROIS ET DAMES DES TROIS CITÉS ",null,null,null,null,null,null,null,null,null,null,null,null,null,null,null,null,null,null,"CP 86"]
[]
[null,"VF","SF+","SF","JF","CF","MF","BF","PuF","PoF","PpF","VM","SM+","SM","JM","CM","MM","BM","PuM","PoM","PpM"]
[]
[null,"VF","SF+","SF","JF","CF","MF","BF","PuF","PoF","PpF","VM","SM+","SM","JM","CM","MM","BM","PuM","PoM","PpM"]
[null,"54 COLLÈGE D'ARGENTAT ",null,null,null,null,null,null,null,null,null,null,null,null,null,null,null,null,null,null,"LIM 19"]
[]
[null,"55 BRIVE LE CAVALIER GAILLARD ",null,null,null,null,null,null,null,null,null,null,null,null,null,null,null,null,null,null,"LIM 19"]
[]
[]
[]
[]
[null,"56 ALEKHINE BRIVE CHESS CE DE BRIVE ",null,null,null,null,null,null,null,null,null,null,null,null,null,null,null,null,null,null,"LIM 19"]
[]
[null,"57 CERCLE D'ÉCHECS D'EGLETONS ",null,null,null,null,null,null,null,null,null,null,null,null,null,null,null,null,null,null,"LIM 19"]
[]
[]
[]
[null,"58 MEYSSAC ÉCHECS ",null,null,null,null,null,null,null,null,null,null,null,null,null,null,null,null,null,null,"LIM 19"]
[]
[null,"59 CLUB D'ÉCHECS DU PAYS DE BRIVE ",null,null,null,null,null,null,null,null,null,null,null,null,null,null,null,null,null,null,"LIM 19"]
[]
[]
[]
[]
[null,"VF","SF+","SF","JF","CF","MF","BF","PuF","PoF","PpF","VM","SM+","SM","JM","CM","MM","BM","PuM","PoM","PpM"]
[null,"60 ÉCHIQUIER TULLISTE ",null,null,null,null,null,null,null,null,null,null,null,null,null,null,null,null,null,null,"LIM 19"]
[]
[null," 61 CREUSE-ÉCHECS ",null,null,null,null,null,null,null,null,null,null,null,null,null,null,null,null,null,null,"LIM 23"]
[]
[null,"62 COUZEIX CHESS CLUB (C3) ",null,null,null,null,null,null,null,null,null,null,null,null,null,null,null,null,null,null,"LIM 87"]
[]
[null,"63 ISLES ÉCHECS ",null,null,null,null,null,null,null,null,null,null,null,null,null,null,null,null,null,null,"LIM 87"]
[]
[null,"64 LEC ÉCHIQUIER LIMOUSIN ",null,null,null,null,null,null,null,null,null,null,null,null,null,null,null,null,null,null,"LIM 87"]
[]
[]
[]
[]
[]
[]
[null,"65 ASSJ ÉCHECS - CERCLE PHILIDOR SAINT-JUNIEN ",null,null,null,null,null,null,null,null,null,null,null,null,null,null,null,null,null,null,"LIM 87"]
[]
[null,"VF","SF+","SF","JF","CF","MF","BF","PuF","PoF","PpF","VM","SM+","SM","JM","CM","MM","BM","PuM","PoM","PpM"]
[]
[null,"Récupérer les données sur le site de la ligue avec les feuilles de saisie, puis les transcrire sur la grille ci-dessus."]

{"sheet":"Grille saisie 2","index":25,"n_rows":47,"n_cols":14,"rows_kept":47,"cut":false,"hidden":false,"merged":[[26,11,26,13],[28,11,28,13],[40,11,40,13],[42,11,42,13],[44,11,44,13],[30,11,30,13],[32,11,32,13],[34,11,34,13],[36,11,36,13],[38,11,38,13],[4,11,4,13],[46,11,46,13],[42,7,42,9],[44,7,44,9],[46,7,46,9],[32,7,32,9],[34,7,34,9],[36,7,36,9],[38,7,38,9],[40,7,40,9],[10,7,10,9],[12,7,12,9],[14,7,14,9],[16,7,16,9],[18,7,18,9],[8,11,8,13],[26,7,26,9],[28,7,28,9],[30,7,30,9],[24,3,24,5],[26,3,26,5],[28,3,28,5],[30,3,30,5],[18,11,18,13],[6,11,6,13],[20,7,20,9],[22,7,22,9],[24,7,24,9],[10,11,10,13],[12,11,12,13],[14,11,14,13],[16,11,16,13],[20,11,20,13],[22,11,22,13],[24,11,24,13],[40,3,40,5],[42,3,42,5],[44,3,44,5],[46,3,46,5],[10,3,10,5],[12,3,12,5],[34,3,34,5],[36,3,36,5],[38,3,38,5],[32,3,32,5],[14,3,14,5],[16,3,16,5],[18,3,18,5],[20,3,20,5],[22,3,22,5],[4,3,4,5],[6,3,6,5],[8,3,8,5],[4,7,4,9],[6,7,6,9],[8,7,8,9]]}
[]
[]
[]
[null,null,null,"Licences A","Licences B","Lic. A+B",null,"Licences A","Licences B","Lic. A+B",null,"Licences A","Licences B","Lic. A+B"]
[null,null,null,"1 CYRANO 18+5=23 ; 1",null,null,null,"23 AGEN 80+48=128 ; 5",null,null,null,"45 SURGERE 45+71=116 ; 4"]
[]
[null,"Nombre de licences A, nombre de licenceB, total",null,"2 LE FLEIX 13+3=16 ; 1",null,null,null,"24 MARMANDE 6+8=14 ; 1",null,null,null,"46 BRESSUIRE 23+8=31 ; 1"]
[null,"et nombre de lignes à prévoir en fonction du nombre"]
[null,"total de licences par club.",null,"3 NONTRON 15+27=42 ; 3",null,null,null,"25 PAYS DE LAUZUN 13+11=44 ; 3",null,null,null,"47 NIORT 55+31=86 ; 4"]
[]
[null,null,null,"4 SALIGNAC 6+27=33 ; 1",null,null,null,"26 VILLENEUVE 38+24=62 ; 3",null,null,null,"48 SAINT MAIXENT 17+6=23 ; 1"]
[]
[null,null,null,"5 SAINT SOUR 4+0=4 ; 1",null,null,null,"27 BAYONNE 17+15=32 ; 1",null,null,null,"49 THOUARS 12+11=23 ; 1"]
[]
[null,null,null,"6 AGJA 96+32=128 ; 5",null,null,null,"28 AVIRON 42+139=181 ; 6",null,null,null,"50 POITEVIN 29+19=48 ; 3"]
[]
[null,null,null,"7 ASPOM 84+57=141 ; 5",null,null,null,"29 SICSBT 15+3=18 ; 1",null,null,null,"51 CHATELLERAUD 5+0=5 ; 1"]
[]
[null,null,null,"8 USB-BE 46+66=112 ; 4",null,null,null,"30 HENRI IV 59+112=171 ; 6",null,null,null,"52 POITIERS MIGNE 33+2=35 ; 1"]
[]
[null,null,null,"9 BORDEAUX 149+155=304 ; 9",null,null,null,"31 SARRAILH 14+3=17 ; 1",null,null,null,"53 3 CITES 12+9=21 ; 1"]
[]
[null,null,null," 10 ALGB 93+202=295 ; 9",null,null,null,"32 BERLIOZ 24+15=39 ; 1",null,null,null,"54 ARGENTAT 5+10=15 ; 1"]
[]
[null,null,null,"11 CREON 54+34=88 ; 4",null,null,null,"33 BEARN 8+9=17 ; 1",null,null,null,"55 BRIVE GAILLARD 43+58=101 ; 4"]
[]
[null,null,null,"12 GUJAN 30+27=57 ; 3",null,null,null,"34 LA TOUR 5+11=16 ; 1",null,null,null,"56 ALEKHINE 5+0=5 ; 1"]
[]
[null,null,null,"13 LA REOLE 5+7=12 ; 1",null,null,null,"35 ANGOULEME 17+16=33 ; 1",null,null,null,"57 EGLETONS 5+53=58 ; 3"]
[]
[null,null,null,"14 MEDOC 39+5=44 ; 3",null,null,null,"36 BARBEZIEUX 6+14=20 ; 1",null,null,null,"58 MEYSSAC 9+26=35 ; 1"]
[]
[null,null,null,"15 LIBOURNE 31+97=128 ; 5",null,null,null,"37 CHASSENEUIL 14+18=32 ; 1",null,null,null,"59 PAYS DE BRIVE 32+71=103 ; 4"]
[]
[null,null,null,"16 MERIGNAC 9+0=9 ; 1",null,null,null,"38 COGNAC 27+4=31 ; 1",null,null,null,"60 TULLE 10+3=13 ; 1"]
[]
[null,null,null," 17 PAREMPUYRE 18+14=32 ; 1",null,null,null,"39 LA COURONNE 42+21=63 ; 3",null,null,null,"61 CREUSE 5+5=10 ; 1"]
[]
[null,null,null,"18 TRESSES 47+54=101 ; 4",null,null,null,"40 MONTBRON 20+22=42 ; 3",null,null,null,"62 COUZEIX 15+21=36 ; 1"]
[]
[null,null,null,"19 DAX 20+7=27 ; 1",null,null,null,"41 LA ROCHELLE 29+0=29 ; 1",null,null,null,"63 ISLES 13+9=22 ; 1"]
[]
[null,null,null,"20 MIMIZAN 6+11=17 ; 1",null,null,null,"42 OLERON 16+15=31 ; 1",null,null,null,"64 LIMOUSIN 70+98=168 ; 6"]
[]
[null,null,null,"21 MONT DE MARSAN 59+154=213 ; 7",null,null,null,"43 ROCHEFORT 27+6=33 ; 1",null,null,null,"65 AS St Junien 6+0=6 ; 1"]
[]
[null,null,null,"22 HOSSEGOR 13+17=30 ; 1",null,null,null,"44 GERMANICUS 35+86=121 ; 5"]